{"text_format":"1","workbook":"xlsx","n_sheets":11,"sheets":["Enable Content Message","Main","Account","Tenant","Usage","ACTVMHPACCNT","BllSmmry","BllTmplt","Dt1","Dt2","Data"],"not_rendered":{"charts":0,"images":8,"macros":1,"external_links":0,"defined_names":3,"comments":0,"pivot_tables":0},"unopened":[],"bounds":{"document_bytes":16777216,"sheet_cells":100000,"rows_first":2000,"rows_last":500,"rows_between":2000,"halvings":0,"cell_chars":16384,"cell_head_chars":4096},"cells_cut":0,"cells_raw":0,"read":"whole","date_system":"1900"}

{"sheet":"Enable Content Message","index":0,"n_rows":0,"n_cols":0,"rows_kept":0,"cut":false,"hidden":false,"merged":[]}

{"sheet":"Main","index":1,"n_rows":20,"n_cols":2,"rows_kept":20,"cut":false,"hidden":true,"merged":[[5,0,7,13],[13,1,14,13]]}
[]
[]
[]
[]
[]
["By submission of using this tenant bill calculation tool, I state that the information entered is correct, that I am a Southern California Edison® customer with a DMS-2 account, receiving Community Choice Aggregation service, and I have enrolled in the Tenant Bill Calculation Service."]
[]
[]
[]
["I understand:"]
[]
["•","Applicable charges will be displayed on each bill"]
["•","Tenant bills will be provided immediately after the calculation"]
["•","I am responsible for providing all applicable Community Choice Aggregation (CCA) charges to SCE, by either contacting my CCA directly or by visiting its website to obtain applicable charges (e.g., https://cleanpoweralliance.org/residential-rates/)"]
[]
["•","Upon completion of using this tool, I will have two different bills for each tenant – one for SCE charges and another for CCA-related charges"]
[]
["By clicking 'I Agree', the 'Submit' button will become enabled.  Upon submitting agreement, the additional buttons will be made available."]
[]
["I have agreed to the terms listed above."]

{"sheet":"Account","index":2,"n_rows":2,"n_cols":36,"rows_kept":2,"cut":false,"hidden":true,"merged":[]}
["ID","CntrctNmbr","CntrctNm","StrtAddrss","Cty","Stt","ZpCd","EmlAddrss","BllngRt","BllPrdStrtDt","BllPrdEndDt","SbMtrMxRd","DrctAccss","TrnstnlBndldSrvcDrctAccss","CntnsDrctAccss","RtrnngCntnsDrctAccss","CmmntyChcAggrgtn","TrnstnlBndldSrvcCmmntyChcAggrgtn","VntgYr","TrnstnlBndldSrvcFctr","MltDwllng","NEM2.0","NBCkWh","UUTCrrnt","UUTPrvs","UUTChngDt","SttTxCrrnt","SttTxPrvs","SttTxChngDt","CtyFrnchsSrchrgSntBrbr","CtyFrnchsSrchrgVntr","TrnstnlBndldSrvc","BndldCstmr","CCACrrnt","CCAPrvs","CCAChngDt"]
["1",null,null,null,null,null,null,null,null,null,null,null,null,null,null,null,null,null,null,null,null,null,null,null,null,null,null,null,null,null,null,{"$f":"IF(OR($N2=TRUE,$R2=TRUE),TRUE,FALSE)","v":false},{"$f":"IF(AND($N2=FALSE,$R2=FALSE,$M2=FALSE,Q$2=FALSE),TRUE,FALSE)","v":true}]

{"sheet":"Tenant","index":3,"n_rows":301,"n_cols":10,"rows_kept":301,"cut":false,"hidden":true,"merged":[]}
["ID","TnntNm","TnntAddrss","TnntNmbr","SbMtrBllngRt","MdclBslnAllctn","MdclDvcs","UUTExmpt","SttTxExmpt","AllElctrc"]
[1]
[2]
[3]
[4]
[5]
[6]
[7]
[8]
[9]
[10]
[11]
[12]
[13]
[14]
[15]
[16]
[17]
[18]
[19]
[20]
[21]
[22]
[23]
[24]
[25]
[26]
[27]
[28]
[29]
[30]
[31]
[32]
[33]
[34]
[35]
[36]
[37]
[38]
[39]
[40]
[41]
[42]
[43]
[44]
[45]
[46]
[47]
[48]
[49]
[50]
[51]
[52]
[53]
[54]
[55]
[56]
[57]
[58]
[59]
[60]
[61]
[62]
[63]
[64]
[65]
[66]
[67]
[68]
[69]
[70]
[71]
[72]
[73]
[74]
[75]
[76]
[77]
[78]
[79]
[80]
[81]
[82]
[83]
[84]
[85]
[86]
[87]
[88]
[89]
[90]
[91]
[92]
[93]
[94]
[95]
[96]
[97]
[98]
[99]
[100]
[101]
[102]
[103]
[104]
[105]
[106]
[107]
[108]
[109]
[110]
[111]
[112]
[113]
[114]
[115]
[116]
[117]
[118]
[119]
[120]
[121]
[122]
[123]
[124]
[125]
[126]
[127]
[128]
[129]
[130]
[131]
[132]
[133]
[134]
[135]
[136]
[137]
[138]
[139]
[140]
[141]
[142]
[143]
[144]
[145]
[146]
[147]
[148]
[149]
[150]
[151]
[152]
[153]
[154]
[155]
[156]
[157]
[158]
[159]
[160]
[161]
[162]
[163]
[164]
[165]
[166]
[167]
[168]
[169]
[170]
[171]
[172]
[173]
[174]
[175]
[176]
[177]
[178]
[179]
[180]
[181]
[182]
[183]
[184]
[185]
[186]
[187]
[188]
[189]
[190]
[191]
[192]
[193]
[194]
[195]
[196]
[197]
[198]
[199]
[200]
[201]
[202]
[203]
[204]
[205]
[206]
[207]
[208]
[209]
[210]
[211]
[212]
[213]
[214]
[215]
[216]
[217]
[218]
[219]
[220]
[221]
[222]
[223]
[224]
[225]
[226]
[227]
[228]
[229]
[230]
[231]
[232]
[233]
[234]
[235]
[236]
[237]
[238]
[239]
[240]
[241]
[242]
[243]
[244]
[245]
[246]
[247]
[248]
[249]
[250]
[251]
[252]
[253]
[254]
[255]
[256]
[257]
[258]
[259]
[260]
[261]
[262]
[263]
[264]
[265]
[266]
[267]
[268]
[269]
[270]
[271]
[272]
[273]
[274]
[275]
[276]
[277]
[278]
[279]
[280]
[281]
[282]
[283]
[284]
[285]
[286]
[287]
[288]
[289]
[290]
[291]
[292]
[293]
[294]
[295]
[296]
[297]
[298]
[299]
[300]

{"sheet":"Usage","index":4,"n_rows":301,"n_cols":26,"rows_kept":301,"cut":false,"hidden":true,"merged":[]}
["ID","TnntNm","TnntNmbr","BllPrdStrtDt","BllPrdEndDt","SbMtrRdStrt","SbMtrRdEnd","TtlUsg","TtlNmbrOfDys","OldDysCCARt","NwDysCCARt","OldkWhCCARt","NwkWhCCARt","CCARtPrvs","CCARtCrrnt","OldDysCCAUUTTx","NwDysCCAUUTTx","CCAUUTTxPrvs","CCAUUTTxCrrnt","OldDysCCAEnrgySrchrg","NwDysCCAEnrgySrchrg","OldkWhCCAEnrgySrchrg","NwkWhCCAEnrgySrchrg","CCAEnrgySrchrgPrvs","CCAEnrgySrchrgCrrnt","CCASbttlOfChrgs"]
[1,null,null,null,null,null,null,null,{"$f":"SUM($E2-$D2+1)","v":1},{"$f":"IF(Account!$AJ$2=0,0,SUM(Account!$AJ$2-$D2))","v":0},{"$f":"SUM($I2-$J2)","v":1},{"$f":"ROUND(IF($J2=0,0,SUM($H2/$I2*$K2)),2)","v":0},{"$f":"ROUND(SUM($H2-$L2),2)","v":0},{"$f":"ROUND(SUM($L2*Account!$AI$2),2)","v":0},{"$f":"ROUND(SUM($M2*Account!$AH$2),2)","v":0},{"$f":"IF(Account!$Z$2=0,0,SUM(Account!$Z$2-$D2))","v":0},{"$f":"SUM($I2-$P2)","v":1},{"$f":"SUM(SUM(SUM(SUM($N2:$O2)/$I2*$P2)*Account!$Y$2)/100)","v":0},{"$f":"SUM(SUM(SUM(SUM($N2:$O2)/$I2*$Q2)*Account!$X$2)/100)","v":0},{"$f":"IF(Account!$AC$2=0,0,SUM(Account!$AC$2-$D2))","v":0},{"$f":"SUM($I2-$T2)","v":1},{"$f":"ROUND(IF($T2=0,0,SUM($H2/$I2*$T2)),2)","v":0},{"$f":"ROUND(SUM($H2-$V2),2)","v":0},{"$f":"SUM($V2*Account!$AB$2)","v":0},{"$f":"SUM($W2*Account!$AA$2)","v":0},{"$f":"SUM($N2:$O2,$R2:$S2,$X2:$Y2)","v":0}]
[2,null,null,null,null,null,null,null,{"$f":"SUM($E3-$D3+1)","v":1},{"$f":"IF(Account!$AJ$2=0,0,SUM(Account!$AJ$2-$D3))","v":0},1,{"$f":"ROUND(IF($J3=0,0,SUM($H3/$I3*$K3)),2)","v":0},{"$f":"ROUND(SUM($H3-$L3),2)","v":0},{"$f":"ROUND(SUM($L3*Account!$AI$2),2)","v":0},{"$f":"ROUND(SUM($M3*Account!$AH$2),2)","v":0},{"$f":"IF(Account!$Z$2=0,0,SUM(Account!$Z$2-$D3))","v":0},1,{"$f":"SUM(SUM(SUM(SUM($N3:$O3)/$I3*$P3)*Account!$Y$2)/100)","v":0},{"$f":"SUM(SUM(SUM(SUM($N3:$O3)/$I3*$Q3)*Account!$X$2)/100)","v":0},{"$f":"IF(Account!$AC$2=0,0,SUM(Account!$AC$2-$D3))","v":0},1,{"$f":"ROUND(IF($T3=0,0,SUM($H3/$I3*$T3)),2)","v":0},{"$f":"ROUND(SUM($H3-$V3),2)","v":0},{"$f":"SUM($V3*Account!$AB$2)","v":0},{"$f":"SUM($W3*Account!$AA$2)","v":0},{"$f":"SUM($N3:$O3,$R3:$S3,$X3:$Y3)","v":0}]
[3,null,null,null,null,null,null,null,1,{"$f":"IF(Account!$AJ$2=0,0,SUM(Account!$AJ$2-$D4))","v":0},1,0,0,{"$f":"ROUND(SUM($L4*Account!$AI$2),2)","v":0},{"$f":"ROUND(SUM($M4*Account!$AH$2),2)","v":0},{"$f":"IF(Account!$Z$2=0,0,SUM(Account!$Z$2-$D4))","v":0},1,{"$f":"SUM(SUM(SUM(SUM($N4:$O4)/$I4*$P4)*Account!$Y$2)/100)","v":0},{"$f":"SUM(SUM(SUM(SUM($N4:$O4)/$I4*$Q4)*Account!$X$2)/100)","v":0},{"$f":"IF(Account!$AC$2=0,0,SUM(Account!$AC$2-$D4))","v":0},1,0,0,{"$f":"SUM($V4*Account!$AB$2)","v":0},{"$f":"SUM($W4*Account!$AA$2)","v":0},0]
[4,null,null,null,null,null,null,null,1,{"$f":"IF(Account!$AJ$2=0,0,SUM(Account!$AJ$2-$D5))","v":0},1,0,0,{"$f":"ROUND(SUM($L5*Account!$AI$2),2)","v":0},{"$f":"ROUND(SUM($M5*Account!$AH$2),2)","v":0},{"$f":"IF(Account!$Z$2=0,0,SUM(Account!$Z$2-$D5))","v":0},1,{"$f":"SUM(SUM(SUM(SUM($N5:$O5)/$I5*$P5)*Account!$Y$2)/100)","v":0},{"$f":"SUM(SUM(SUM(SUM($N5:$O5)/$I5*$Q5)*Account!$X$2)/100)","v":0},{"$f":"IF(Account!$AC$2=0,0,SUM(Account!$AC$2-$D5))","v":0},1,0,0,{"$f":"SUM($V5*Account!$AB$2)","v":0},{"$f":"SUM($W5*Account!$AA$2)","v":0},0]
[5,null,null,null,null,null,null,null,1,{"$f":"IF(Account!$AJ$2=0,0,SUM(Account!$AJ$2-$D6))","v":0},1,0,0,{"$f":"ROUND(SUM($L6*Account!$AI$2),2)","v":0},{"$f":"ROUND(SUM($M6*Account!$AH$2),2)","v":0},{"$f":"IF(Account!$Z$2=0,0,SUM(Account!$Z$2-$D6))","v":0},1,{"$f":"SUM(SUM(SUM(SUM($N6:$O6)/$I6*$P6)*Account!$Y$2)/100)","v":0},{"$f":"SUM(SUM(SUM(SUM($N6:$O6)/$I6*$Q6)*Account!$X$2)/100)","v":0},{"$f":"IF(Account!$AC$2=0,0,SUM(Account!$AC$2-$D6))","v":0},1,0,0,{"$f":"SUM($V6*Account!$AB$2)","v":0},{"$f":"SUM($W6*Account!$AA$2)","v":0},0]
[6,null,null,null,null,null,null,null,1,{"$f":"IF(Account!$AJ$2=0,0,SUM(Account!$AJ$2-$D7))","v":0},1,0,0,{"$f":"ROUND(SUM($L7*Account!$AI$2),2)","v":0},{"$f":"ROUND(SUM($M7*Account!$AH$2),2)","v":0},{"$f":"IF(Account!$Z$2=0,0,SUM(Account!$Z$2-$D7))","v":0},1,{"$f":"SUM(SUM(SUM(SUM($N7:$O7)/$I7*$P7)*Account!$Y$2)/100)","v":0},{"$f":"SUM(SUM(SUM(SUM($N7:$O7)/$I7*$Q7)*Account!$X$2)/100)","v":0},{"$f":"IF(Account!$AC$2=0,0,SUM(Account!$AC$2-$D7))","v":0},1,0,0,{"$f":"SUM($V7*Account!$AB$2)","v":0},{"$f":"SUM($W7*Account!$AA$2)","v":0},0]
[7,null,null,null,null,null,null,null,1,{"$f":"IF(Account!$AJ$2=0,0,SUM(Account!$AJ$2-$D8))","v":0},1,0,0,{"$f":"ROUND(SUM($L8*Account!$AI$2),2)","v":0},{"$f":"ROUND(SUM($M8*Account!$AH$2),2)","v":0},{"$f":"IF(Account!$Z$2=0,0,SUM(Account!$Z$2-$D8))","v":0},1,{"$f":"SUM(SUM(SUM(SUM($N8:$O8)/$I8*$P8)*Account!$Y$2)/100)","v":0},{"$f":"SUM(SUM(SUM(SUM($N8:$O8)/$I8*$Q8)*Account!$X$2)/100)","v":0},{"$f":"IF(Account!$AC$2=0,0,SUM(Account!$AC$2-$D8))","v":0},1,0,0,{"$f":"SUM($V8*Account!$AB$2)","v":0},{"$f":"SUM($W8*Account!$AA$2)","v":0},0]
[8,null,null,null,null,null,null,null,1,{"$f":"IF(Account!$AJ$2=0,0,SUM(Account!$AJ$2-$D9))","v":0},1,0,0,{"$f":"ROUND(SUM($L9*Account!$AI$2),2)","v":0},{"$f":"ROUND(SUM($M9*Account!$AH$2),2)","v":0},{"$f":"IF(Account!$Z$2=0,0,SUM(Account!$Z$2-$D9))","v":0},1,{"$f":"SUM(SUM(SUM(SUM($N9:$O9)/$I9*$P9)*Account!$Y$2)/100)","v":0},{"$f":"SUM(SUM(SUM(SUM($N9:$O9)/$I9*$Q9)*Account!$X$2)/100)","v":0},{"$f":"IF(Account!$AC$2=0,0,SUM(Account!$AC$2-$D9))","v":0},1,0,0,{"$f":"SUM($V9*Account!$AB$2)","v":0},{"$f":"SUM($W9*Account!$AA$2)","v":0},0]
[9,null,null,null,null,null,null,null,1,{"$f":"IF(Account!$AJ$2=0,0,SUM(Account!$AJ$2-$D10))","v":0},1,0,0,{"$f":"ROUND(SUM($L10*Account!$AI$2),2)","v":0},{"$f":"ROUND(SUM($M10*Account!$AH$2),2)","v":0},{"$f":"IF(Account!$Z$2=0,0,SUM(Account!$Z$2-$D10))","v":0},1,{"$f":"SUM(SUM(SUM(SUM($N10:$O10)/$I10*$P10)*Account!$Y$2)/100)","v":0},{"$f":"SUM(SUM(SUM(SUM($N10:$O10)/$I10*$Q10)*Account!$X$2)/100)","v":0},{"$f":"IF(Account!$AC$2=0,0,SUM(Account!$AC$2-$D10))","v":0},1,0,0,{"$f":"SUM($V10*Account!$AB$2)","v":0},{"$f":"SUM($W10*Account!$AA$2)","v":0},0]
[10,null,null,null,null,null,null,null,1,{"$f":"IF(Account!$AJ$2=0,0,SUM(Account!$AJ$2-$D11))","v":0},1,0,0,{"$f":"ROUND(SUM($L11*Account!$AI$2),2)","v":0},{"$f":"ROUND(SUM($M11*Account!$AH$2),2)","v":0},{"$f":"IF(Account!$Z$2=0,0,SUM(Account!$Z$2-$D11))","v":0},1,{"$f":"SUM(SUM(SUM(SUM($N11:$O11)/$I11*$P11)*Account!$Y$2)/100)","v":0},{"$f":"SUM(SUM(SUM(SUM($N11:$O11)/$I11*$Q11)*Account!$X$2)/100)","v":0},{"$f":"IF(Account!$AC$2=0,0,SUM(Account!$AC$2-$D11))","v":0},1,0,0,{"$f":"SUM($V11*Account!$AB$2)","v":0},{"$f":"SUM($W11*Account!$AA$2)","v":0},0]
[11,null,null,null,null,null,null,null,1,{"$f":"IF(Account!$AJ$2=0,0,SUM(Account!$AJ$2-$D12))","v":0},1,0,0,{"$f":"ROUND(SUM($L12*Account!$AI$2),2)","v":0},{"$f":"ROUND(SUM($M12*Account!$AH$2),2)","v":0},{"$f":"IF(Account!$Z$2=0,0,SUM(Account!$Z$2-$D12))","v":0},1,{"$f":"SUM(SUM(SUM(SUM($N12:$O12)/$I12*$P12)*Account!$Y$2)/100)","v":0},{"$f":"SUM(SUM(SUM(SUM($N12:$O12)/$I12*$Q12)*Account!$X$2)/100)","v":0},{"$f":"IF(Account!$AC$2=0,0,SUM(Account!$AC$2-$D12))","v":0},1,0,0,{"$f":"SUM($V12*Account!$AB$2)","v":0},{"$f":"SUM($W12*Account!$AA$2)","v":0},0]
[12,null,null,null,null,null,null,null,1,{"$f":"IF(Account!$AJ$2=0,0,SUM(Account!$AJ$2-$D13))","v":0},1,0,0,{"$f":"ROUND(SUM($L13*Account!$AI$2),2)","v":0},{"$f":"ROUND(SUM($M13*Account!$AH$2),2)","v":0},{"$f":"IF(Account!$Z$2=0,0,SUM(Account!$Z$2-$D13))","v":0},1,{"$f":"SUM(SUM(SUM(SUM($N13:$O13)/$I13*$P13)*Account!$Y$2)/100)","v":0},{"$f":"SUM(SUM(SUM(SUM($N13:$O13)/$I13*$Q13)*Account!$X$2)/100)","v":0},{"$f":"IF(Account!$AC$2=0,0,SUM(Account!$AC$2-$D13))","v":0},1,0,0,{"$f":"SUM($V13*Account!$AB$2)","v":0},{"$f":"SUM($W13*Account!$AA$2)","v":0},0]
[13,null,null,null,null,null,null,null,1,{"$f":"IF(Account!$AJ$2=0,0,SUM(Account!$AJ$2-$D14))","v":0},1,0,0,{"$f":"ROUND(SUM($L14*Account!$AI$2),2)","v":0},{"$f":"ROUND(SUM($M14*Account!$AH$2),2)","v":0},{"$f":"IF(Account!$Z$2=0,0,SUM(Account!$Z$2-$D14))","v":0},1,{"$f":"SUM(SUM(SUM(SUM($N14:$O14)/$I14*$P14)*Account!$Y$2)/100)","v":0},{"$f":"SUM(SUM(SUM(SUM($N14:$O14)/$I14*$Q14)*Account!$X$2)/100)","v":0},{"$f":"IF(Account!$AC$2=0,0,SUM(Account!$AC$2-$D14))","v":0},1,0,0,{"$f":"SUM($V14*Account!$AB$2)","v":0},{"$f":"SUM($W14*Account!$AA$2)","v":0},0]
[14,null,null,null,null,null,null,null,1,{"$f":"IF(Account!$AJ$2=0,0,SUM(Account!$AJ$2-$D15))","v":0},1,0,0,{"$f":"ROUND(SUM($L15*Account!$AI$2),2)","v":0},{"$f":"ROUND(SUM($M15*Account!$AH$2),2)","v":0},{"$f":"IF(Account!$Z$2=0,0,SUM(Account!$Z$2-$D15))","v":0},1,{"$f":"SUM(SUM(SUM(SUM($N15:$O15)/$I15*$P15)*Account!$Y$2)/100)","v":0},{"$f":"SUM(SUM(SUM(SUM($N15:$O15)/$I15*$Q15)*Account!$X$2)/100)","v":0},{"$f":"IF(Account!$AC$2=0,0,SUM(Account!$AC$2-$D15))","v":0},1,0,0,{"$f":"SUM($V15*Account!$AB$2)","v":0},{"$f":"SUM($W15*Account!$AA$2)","v":0},0]
[15,null,null,null,null,null,null,null,1,{"$f":"IF(Account!$AJ$2=0,0,SUM(Account!$AJ$2-$D16))","v":0},1,0,0,{"$f":"ROUND(SUM($L16*Account!$AI$2),2)","v":0},{"$f":"ROUND(SUM($M16*Account!$AH$2),2)","v":0},{"$f":"IF(Account!$Z$2=0,0,SUM(Account!$Z$2-$D16))","v":0},1,{"$f":"SUM(SUM(SUM(SUM($N16:$O16)/$I16*$P16)*Account!$Y$2)/100)","v":0},{"$f":"SUM(SUM(SUM(SUM($N16:$O16)/$I16*$Q16)*Account!$X$2)/100)","v":0},{"$f":"IF(Account!$AC$2=0,0,SUM(Account!$AC$2-$D16))","v":0},1,0,0,{"$f":"SUM($V16*Account!$AB$2)","v":0},{"$f":"SUM($W16*Account!$AA$2)","v":0},0]
[16,null,null,null,null,null,null,null,1,{"$f":"IF(Account!$AJ$2=0,0,SUM(Account!$AJ$2-$D17))","v":0},1,0,0,{"$f":"ROUND(SUM($L17*Account!$AI$2),2)","v":0},{"$f":"ROUND(SUM($M17*Account!$AH$2),2)","v":0},{"$f":"IF(Account!$Z$2=0,0,SUM(Account!$Z$2-$D17))","v":0},1,{"$f":"SUM(SUM(SUM(SUM($N17:$O17)/$I17*$P17)*Account!$Y$2)/100)","v":0},{"$f":"SUM(SUM(SUM(SUM($N17:$O17)/$I17*$Q17)*Account!$X$2)/100)","v":0},{"$f":"IF(Account!$AC$2=0,0,SUM(Account!$AC$2-$D17))","v":0},1,0,0,{"$f":"SUM($V17*Account!$AB$2)","v":0},{"$f":"SUM($W17*Account!$AA$2)","v":0},0]
[17,null,null,null,null,null,null,null,1,{"$f":"IF(Account!$AJ$2=0,0,SUM(Account!$AJ$2-$D18))","v":0},1,0,0,{"$f":"ROUND(SUM($L18*Account!$AI$2),2)","v":0},{"$f":"ROUND(SUM($M18*Account!$AH$2),2)","v":0},{"$f":"IF(Account!$Z$2=0,0,SUM(Account!$Z$2-$D18))","v":0},1,{"$f":"SUM(SUM(SUM(SUM($N18:$O18)/$I18*$P18)*Account!$Y$2)/100)","v":0},{"$f":"SUM(SUM(SUM(SUM($N18:$O18)/$I18*$Q18)*Account!$X$2)/100)","v":0},{"$f":"IF(Account!$AC$2=0,0,SUM(Account!$AC$2-$D18))","v":0},1,0,0,{"$f":"SUM($V18*Account!$AB$2)","v":0},{"$f":"SUM($W18*Account!$AA$2)","v":0},0]
[18,null,null,null,null,null,null,null,1,{"$f":"IF(Account!$AJ$2=0,0,SUM(Account!$AJ$2-$D19))","v":0},1,0,0,{"$f":"ROUND(SUM($L19*Account!$AI$2),2)","v":0},{"$f":"ROUND(SUM($M19*Account!$AH$2),2)","v":0},{"$f":"IF(Account!$Z$2=0,0,SUM(Account!$Z$2-$D19))","v":0},1,{"$f":"SUM(SUM(SUM(SUM($N19:$O19)/$I19*$P19)*Account!$Y$2)/100)","v":0},{"$f":"SUM(SUM(SUM(SUM($N19:$O19)/$I19*$Q19)*Account!$X$2)/100)","v":0},{"$f":"IF(Account!$AC$2=0,0,SUM(Account!$AC$2-$D19))","v":0},1,0,0,{"$f":"SUM($V19*Account!$AB$2)","v":0},{"$f":"SUM($W19*Account!$AA$2)","v":0},0]
[19,null,null,null,null,null,null,null,1,{"$f":"IF(Account!$AJ$2=0,0,SUM(Account!$AJ$2-$D20))","v":0},1,0,0,{"$f":"ROUND(SUM($L20*Account!$AI$2),2)","v":0},{"$f":"ROUND(SUM($M20*Account!$AH$2),2)","v":0},{"$f":"IF(Account!$Z$2=0,0,SUM(Account!$Z$2-$D20))","v":0},1,{"$f":"SUM(SUM(SUM(SUM($N20:$O20)/$I20*$P20)*Account!$Y$2)/100)","v":0},{"$f":"SUM(SUM(SUM(SUM($N20:$O20)/$I20*$Q20)*Account!$X$2)/100)","v":0},{"$f":"IF(Account!$AC$2=0,0,SUM(Account!$AC$2-$D20))","v":0},1,0,0,{"$f":"SUM($V20*Account!$AB$2)","v":0},{"$f":"SUM($W20*Account!$AA$2)","v":0},0]
[20,null,null,null,null,null,null,null,1,{"$f":"IF(Account!$AJ$2=0,0,SUM(Account!$AJ$2-$D21))","v":0},1,0,0,{"$f":"ROUND(SUM($L21*Account!$AI$2),2)","v":0},{"$f":"ROUND(SUM($M21*Account!$AH$2),2)","v":0},{"$f":"IF(Account!$Z$2=0,0,SUM(Account!$Z$2-$D21))","v":0},1,{"$f":"SUM(SUM(SUM(SUM($N21:$O21)/$I21*$P21)*Account!$Y$2)/100)","v":0},{"$f":"SUM(SUM(SUM(SUM($N21:$O21)/$I21*$Q21)*Account!$X$2)/100)","v":0},{"$f":"IF(Account!$AC$2=0,0,SUM(Account!$AC$2-$D21))","v":0},1,0,0,{"$f":"SUM($V21*Account!$AB$2)","v":0},{"$f":"SUM($W21*Account!$AA$2)","v":0},0]
[21,null,null,null,null,null,null,null,1,{"$f":"IF(Account!$AJ$2=0,0,SUM(Account!$AJ$2-$D22))","v":0},1,0,0,{"$f":"ROUND(SUM($L22*Account!$AI$2),2)","v":0},{"$f":"ROUND(SUM($M22*Account!$AH$2),2)","v":0},{"$f":"IF(Account!$Z$2=0,0,SUM(Account!$Z$2-$D22))","v":0},1,{"$f":"SUM(SUM(SUM(SUM($N22:$O22)/$I22*$P22)*Account!$Y$2)/100)","v":0},{"$f":"SUM(SUM(SUM(SUM($N22:$O22)/$I22*$Q22)*Account!$X$2)/100)","v":0},{"$f":"IF(Account!$AC$2=0,0,SUM(Account!$AC$2-$D22))","v":0},1,0,0,{"$f":"SUM($V22*Account!$AB$2)","v":0},{"$f":"SUM($W22*Account!$AA$2)","v":0},0]
[22,null,null,null,null,null,null,null,1,{"$f":"IF(Account!$AJ$2=0,0,SUM(Account!$AJ$2-$D23))","v":0},1,0,0,{"$f":"ROUND(SUM($L23*Account!$AI$2),2)","v":0},{"$f":"ROUND(SUM($M23*Account!$AH$2),2)","v":0},{"$f":"IF(Account!$Z$2=0,0,SUM(Account!$Z$2-$D23))","v":0},1,{"$f":"SUM(SUM(SUM(SUM($N23:$O23)/$I23*$P23)*Account!$Y$2)/100)","v":0},{"$f":"SUM(SUM(SUM(SUM($N23:$O23)/$I23*$Q23)*Account!$X$2)/100)","v":0},{"$f":"IF(Account!$AC$2=0,0,SUM(Account!$AC$2-$D23))","v":0},1,0,0,{"$f":"SUM($V23*Account!$AB$2)","v":0},{"$f":"SUM($W23*Account!$AA$2)","v":0},0]
[23,null,null,null,null,null,null,null,1,{"$f":"IF(Account!$AJ$2=0,0,SUM(Account!$AJ$2-$D24))","v":0},1,0,0,{"$f":"ROUND(SUM($L24*Account!$AI$2),2)","v":0},{"$f":"ROUND(SUM($M24*Account!$AH$2),2)","v":0},{"$f":"IF(Account!$Z$2=0,0,SUM(Account!$Z$2-$D24))","v":0},1,{"$f":"SUM(SUM(SUM(SUM($N24:$O24)/$I24*$P24)*Account!$Y$2)/100)","v":0},{"$f":"SUM(SUM(SUM(SUM($N24:$O24)/$I24*$Q24)*Account!$X$2)/100)","v":0},{"$f":"IF(Account!$AC$2=0,0,SUM(Account!$AC$2-$D24))","v":0},1,0,0,{"$f":"SUM($V24*Account!$AB$2)","v":0},{"$f":"SUM($W24*Account!$AA$2)","v":0},0]
[24,null,null,null,null,null,null,null,1,{"$f":"IF(Account!$AJ$2=0,0,SUM(Account!$AJ$2-$D25))","v":0},1,0,0,{"$f":"ROUND(SUM($L25*Account!$AI$2),2)","v":0},{"$f":"ROUND(SUM($M25*Account!$AH$2),2)","v":0},{"$f":"IF(Account!$Z$2=0,0,SUM(Account!$Z$2-$D25))","v":0},1,{"$f":"SUM(SUM(SUM(SUM($N25:$O25)/$I25*$P25)*Account!$Y$2)/100)","v":0},{"$f":"SUM(SUM(SUM(SUM($N25:$O25)/$I25*$Q25)*Account!$X$2)/100)","v":0},{"$f":"IF(Account!$AC$2=0,0,SUM(Account!$AC$2-$D25))","v":0},1,0,0,{"$f":"SUM($V25*Account!$AB$2)","v":0},{"$f":"SUM($W25*Account!$AA$2)","v":0},0]
[25,null,null,null,null,null,null,null,1,{"$f":"IF(Account!$AJ$2=0,0,SUM(Account!$AJ$2-$D26))","v":0},1,0,0,{"$f":"ROUND(SUM($L26*Account!$AI$2),2)","v":0},{"$f":"ROUND(SUM($M26*Account!$AH$2),2)","v":0},{"$f":"IF(Account!$Z$2=0,0,SUM(Account!$Z$2-$D26))","v":0},1,{"$f":"SUM(SUM(SUM(SUM($N26:$O26)/$I26*$P26)*Account!$Y$2)/100)","v":0},{"$f":"SUM(SUM(SUM(SUM($N26:$O26)/$I26*$Q26)*Account!$X$2)/100)","v":0},{"$f":"IF(Account!$AC$2=0,0,SUM(Account!$AC$2-$D26))","v":0},1,0,0,{"$f":"SUM($V26*Account!$AB$2)","v":0},{"$f":"SUM($W26*Account!$AA$2)","v":0},0]
[26,null,null,null,null,null,null,null,1,{"$f":"IF(Account!$AJ$2=0,0,SUM(Account!$AJ$2-$D27))","v":0},1,0,0,{"$f":"ROUND(SUM($L27*Account!$AI$2),2)","v":0},{"$f":"ROUND(SUM($M27*Account!$AH$2),2)","v":0},{"$f":"IF(Account!$Z$2=0,0,SUM(Account!$Z$2-$D27))","v":0},1,{"$f":"SUM(SUM(SUM(SUM($N27:$O27)/$I27*$P27)*Account!$Y$2)/100)","v":0},{"$f":"SUM(SUM(SUM(SUM($N27:$O27)/$I27*$Q27)*Account!$X$2)/100)","v":0},{"$f":"IF(Account!$AC$2=0,0,SUM(Account!$AC$2-$D27))","v":0},1,0,0,{"$f":"SUM($V27*Account!$AB$2)","v":0},{"$f":"SUM($W27*Account!$AA$2)","v":0},0]
[27,null,null,null,null,null,null,null,1,{"$f":"IF(Account!$AJ$2=0,0,SUM(Account!$AJ$2-$D28))","v":0},1,0,0,{"$f":"ROUND(SUM($L28*Account!$AI$2),2)","v":0},{"$f":"ROUND(SUM($M28*Account!$AH$2),2)","v":0},{"$f":"IF(Account!$Z$2=0,0,SUM(Account!$Z$2-$D28))","v":0},1,{"$f":"SUM(SUM(SUM(SUM($N28:$O28)/$I28*$P28)*Account!$Y$2)/100)","v":0},{"$f":"SUM(SUM(SUM(SUM($N28:$O28)/$I28*$Q28)*Account!$X$2)/100)","v":0},{"$f":"IF(Account!$AC$2=0,0,SUM(Account!$AC$2-$D28))","v":0},1,0,0,{"$f":"SUM($V28*Account!$AB$2)","v":0},{"$f":"SUM($W28*Account!$AA$2)","v":0},0]
[28,null,null,null,null,null,null,null,1,{"$f":"IF(Account!$AJ$2=0,0,SUM(Account!$AJ$2-$D29))","v":0},1,0,0,{"$f":"ROUND(SUM($L29*Account!$AI$2),2)","v":0},{"$f":"ROUND(SUM($M29*Account!$AH$2),2)","v":0},{"$f":"IF(Account!$Z$2=0,0,SUM(Account!$Z$2-$D29))","v":0},1,{"$f":"SUM(SUM(SUM(SUM($N29:$O29)/$I29*$P29)*Account!$Y$2)/100)","v":0},{"$f":"SUM(SUM(SUM(SUM($N29:$O29)/$I29*$Q29)*Account!$X$2)/100)","v":0},{"$f":"IF(Account!$AC$2=0,0,SUM(Account!$AC$2-$D29))","v":0},1,0,0,{"$f":"SUM($V29*Account!$AB$2)","v":0},{"$f":"SUM($W29*Account!$AA$2)","v":0},0]
[29,null,null,null,null,null,null,null,1,{"$f":"IF(Account!$AJ$2=0,0,SUM(Account!$AJ$2-$D30))","v":0},1,0,0,{"$f":"ROUND(SUM($L30*Account!$AI$2),2)","v":0},{"$f":"ROUND(SUM($M30*Account!$AH$2),2)","v":0},{"$f":"IF(Account!$Z$2=0,0,SUM(Account!$Z$2-$D30))","v":0},1,{"$f":"SUM(SUM(SUM(SUM($N30:$O30)/$I30*$P30)*Account!$Y$2)/100)","v":0},{"$f":"SUM(SUM(SUM(SUM($N30:$O30)/$I30*$Q30)*Account!$X$2)/100)","v":0},{"$f":"IF(Account!$AC$2=0,0,SUM(Account!$AC$2-$D30))","v":0},1,0,0,{"$f":"SUM($V30*Account!$AB$2)","v":0},{"$f":"SUM($W30*Account!$AA$2)","v":0},0]
[30,null,null,null,null,null,null,null,1,{"$f":"IF(Account!$AJ$2=0,0,SUM(Account!$AJ$2-$D31))","v":0},1,0,0,{"$f":"ROUND(SUM($L31*Account!$AI$2),2)","v":0},{"$f":"ROUND(SUM($M31*Account!$AH$2),2)","v":0},{"$f":"IF(Account!$Z$2=0,0,SUM(Account!$Z$2-$D31))","v":0},1,{"$f":"SUM(SUM(SUM(SUM($N31:$O31)/$I31*$P31)*Account!$Y$2)/100)","v":0},{"$f":"SUM(SUM(SUM(SUM($N31:$O31)/$I31*$Q31)*Account!$X$2)/100)","v":0},{"$f":"IF(Account!$AC$2=0,0,SUM(Account!$AC$2-$D31))","v":0},1,0,0,{"$f":"SUM($V31*Account!$AB$2)","v":0},{"$f":"SUM($W31*Account!$AA$2)","v":0},0]
[31,null,null,null,null,null,null,null,1,{"$f":"IF(Account!$AJ$2=0,0,SUM(Account!$AJ$2-$D32))","v":0},1,0,0,{"$f":"ROUND(SUM($L32*Account!$AI$2),2)","v":0},{"$f":"ROUND(SUM($M32*Account!$AH$2),2)","v":0},{"$f":"IF(Account!$Z$2=0,0,SUM(Account!$Z$2-$D32))","v":0},1,{"$f":"SUM(SUM(SUM(SUM($N32:$O32)/$I32*$P32)*Account!$Y$2)/100)","v":0},{"$f":"SUM(SUM(SUM(SUM($N32:$O32)/$I32*$Q32)*Account!$X$2)/100)","v":0},{"$f":"IF(Account!$AC$2=0,0,SUM(Account!$AC$2-$D32))","v":0},1,0,0,{"$f":"SUM($V32*Account!$AB$2)","v":0},{"$f":"SUM($W32*Account!$AA$2)","v":0},0]
[32,null,null,null,null,null,null,null,1,{"$f":"IF(Account!$AJ$2=0,0,SUM(Account!$AJ$2-$D33))","v":0},1,0,0,{"$f":"ROUND(SUM($L33*Account!$AI$2),2)","v":0},{"$f":"ROUND(SUM($M33*Account!$AH$2),2)","v":0},{"$f":"IF(Account!$Z$2=0,0,SUM(Account!$Z$2-$D33))","v":0},1,{"$f":"SUM(SUM(SUM(SUM($N33:$O33)/$I33*$P33)*Account!$Y$2)/100)","v":0},{"$f":"SUM(SUM(SUM(SUM($N33:$O33)/$I33*$Q33)*Account!$X$2)/100)","v":0},{"$f":"IF(Account!$AC$2=0,0,SUM(Account!$AC$2-$D33))","v":0},1,0,0,{"$f":"SUM($V33*Account!$AB$2)","v":0},{"$f":"SUM($W33*Account!$AA$2)","v":0},0]
[33,null,null,null,null,null,null,null,1,{"$f":"IF(Account!$AJ$2=0,0,SUM(Account!$AJ$2-$D34))","v":0},1,0,0,{"$f":"ROUND(SUM($L34*Account!$AI$2),2)","v":0},{"$f":"ROUND(SUM($M34*Account!$AH$2),2)","v":0},{"$f":"IF(Account!$Z$2=0,0,SUM(Account!$Z$2-$D34))","v":0},1,{"$f":"SUM(SUM(SUM(SUM($N34:$O34)/$I34*$P34)*Account!$Y$2)/100)","v":0},{"$f":"SUM(SUM(SUM(SUM($N34:$O34)/$I34*$Q34)*Account!$X$2)/100)","v":0},{"$f":"IF(Account!$AC$2=0,0,SUM(Account!$AC$2-$D34))","v":0},1,0,0,{"$f":"SUM($V34*Account!$AB$2)","v":0},{"$f":"SUM($W34*Account!$AA$2)","v":0},0]
[34,null,null,null,null,null,null,null,1,{"$f":"IF(Account!$AJ$2=0,0,SUM(Account!$AJ$2-$D35))","v":0},1,0,0,{"$f":"ROUND(SUM($L35*Account!$AI$2),2)","v":0},{"$f":"ROUND(SUM($M35*Account!$AH$2),2)","v":0},{"$f":"IF(Account!$Z$2=0,0,SUM(Account!$Z$2-$D35))","v":0},1,{"$f":"SUM(SUM(SUM(SUM($N35:$O35)/$I35*$P35)*Account!$Y$2)/100)","v":0},{"$f":"SUM(SUM(SUM(SUM($N35:$O35)/$I35*$Q35)*Account!$X$2)/100)","v":0},{"$f":"IF(Account!$AC$2=0,0,SUM(Account!$AC$2-$D35))","v":0},1,0,0,{"$f":"SUM($V35*Account!$AB$2)","v":0},{"$f":"SUM($W35*Account!$AA$2)","v":0},0]
[35,null,null,null,null,null,null,null,1,{"$f":"IF(Account!$AJ$2=0,0,SUM(Account!$AJ$2-$D36))","v":0},1,0,0,{"$f":"ROUND(SUM($L36*Account!$AI$2),2)","v":0},{"$f":"ROUND(SUM($M36*Account!$AH$2),2)","v":0},{"$f":"IF(Account!$Z$2=0,0,SUM(Account!$Z$2-$D36))","v":0},1,{"$f":"SUM(SUM(SUM(SUM($N36:$O36)/$I36*$P36)*Account!$Y$2)/100)","v":0},{"$f":"SUM(SUM(SUM(SUM($N36:$O36)/$I36*$Q36)*Account!$X$2)/100)","v":0},{"$f":"IF(Account!$AC$2=0,0,SUM(Account!$AC$2-$D36))","v":0},1,0,0,{"$f":"SUM($V36*Account!$AB$2)","v":0},{"$f":"SUM($W36*Account!$AA$2)","v":0},0]
[36,null,null,null,null,null,null,null,1,{"$f":"IF(Account!$AJ$2=0,0,SUM(Account!$AJ$2-$D37))","v":0},1,0,0,{"$f":"ROUND(SUM($L37*Account!$AI$2),2)","v":0},{"$f":"ROUND(SUM($M37*Account!$AH$2),2)","v":0},{"$f":"IF(Account!$Z$2=0,0,SUM(Account!$Z$2-$D37))","v":0},1,{"$f":"SUM(SUM(SUM(SUM($N37:$O37)/$I37*$P37)*Account!$Y$2)/100)","v":0},{"$f":"SUM(SUM(SUM(SUM($N37:$O37)/$I37*$Q37)*Account!$X$2)/100)","v":0},{"$f":"IF(Account!$AC$2=0,0,SUM(Account!$AC$2-$D37))","v":0},1,0,0,{"$f":"SUM($V37*Account!$AB$2)","v":0},{"$f":"SUM($W37*Account!$AA$2)","v":0},0]
[37,null,null,null,null,null,null,null,1,{"$f":"IF(Account!$AJ$2=0,0,SUM(Account!$AJ$2-$D38))","v":0},1,0,0,{"$f":"ROUND(SUM($L38*Account!$AI$2),2)","v":0},{"$f":"ROUND(SUM($M38*Account!$AH$2),2)","v":0},{"$f":"IF(Account!$Z$2=0,0,SUM(Account!$Z$2-$D38))","v":0},1,{"$f":"SUM(SUM(SUM(SUM($N38:$O38)/$I38*$P38)*Account!$Y$2)/100)","v":0},{"$f":"SUM(SUM(SUM(SUM($N38:$O38)/$I38*$Q38)*Account!$X$2)/100)","v":0},{"$f":"IF(Account!$AC$2=0,0,SUM(Account!$AC$2-$D38))","v":0},1,0,0,{"$f":"SUM($V38*Account!$AB$2)","v":0},{"$f":"SUM($W38*Account!$AA$2)","v":0},0]
[38,null,null,null,null,null,null,null,1,{"$f":"IF(Account!$AJ$2=0,0,SUM(Account!$AJ$2-$D39))","v":0},1,0,0,{"$f":"ROUND(SUM($L39*Account!$AI$2),2)","v":0},{"$f":"ROUND(SUM($M39*Account!$AH$2),2)","v":0},{"$f":"IF(Account!$Z$2=0,0,SUM(Account!$Z$2-$D39))","v":0},1,{"$f":"SUM(SUM(SUM(SUM($N39:$O39)/$I39*$P39)*Account!$Y$2)/100)","v":0},{"$f":"SUM(SUM(SUM(SUM($N39:$O39)/$I39*$Q39)*Account!$X$2)/100)","v":0},{"$f":"IF(Account!$AC$2=0,0,SUM(Account!$AC$2-$D39))","v":0},1,0,0,{"$f":"SUM($V39*Account!$AB$2)","v":0},{"$f":"SUM($W39*Account!$AA$2)","v":0},0]
[39,null,null,null,null,null,null,null,1,{"$f":"IF(Account!$AJ$2=0,0,SUM(Account!$AJ$2-$D40))","v":0},1,0,0,{"$f":"ROUND(SUM($L40*Account!$AI$2),2)","v":0},{"$f":"ROUND(SUM($M40*Account!$AH$2),2)","v":0},{"$f":"IF(Account!$Z$2=0,0,SUM(Account!$Z$2-$D40))","v":0},1,{"$f":"SUM(SUM(SUM(SUM($N40:$O40)/$I40*$P40)*Account!$Y$2)/100)","v":0},{"$f":"SUM(SUM(SUM(SUM($N40:$O40)/$I40*$Q40)*Account!$X$2)/100)","v":0},{"$f":"IF(Account!$AC$2=0,0,SUM(Account!$AC$2-$D40))","v":0},1,0,0,{"$f":"SUM($V40*Account!$AB$2)","v":0},{"$f":"SUM($W40*Account!$AA$2)","v":0},0]
[40,null,null,null,null,null,null,null,1,{"$f":"IF(Account!$AJ$2=0,0,SUM(Account!$AJ$2-$D41))","v":0},1,0,0,{"$f":"ROUND(SUM($L41*Account!$AI$2),2)","v":0},{"$f":"ROUND(SUM($M41*Account!$AH$2),2)","v":0},{"$f":"IF(Account!$Z$2=0,0,SUM(Account!$Z$2-$D41))","v":0},1,{"$f":"SUM(SUM(SUM(SUM($N41:$O41)/$I41*$P41)*Account!$Y$2)/100)","v":0},{"$f":"SUM(SUM(SUM(SUM($N41:$O41)/$I41*$Q41)*Account!$X$2)/100)","v":0},{"$f":"IF(Account!$AC$2=0,0,SUM(Account!$AC$2-$D41))","v":0},1,0,0,{"$f":"SUM($V41*Account!$AB$2)","v":0},{"$f":"SUM($W41*Account!$AA$2)","v":0},0]
[41,null,null,null,null,null,null,null,1,{"$f":"IF(Account!$AJ$2=0,0,SUM(Account!$AJ$2-$D42))","v":0},1,0,0,{"$f":"ROUND(SUM($L42*Account!$AI$2),2)","v":0},{"$f":"ROUND(SUM($M42*Account!$AH$2),2)","v":0},{"$f":"IF(Account!$Z$2=0,0,SUM(Account!$Z$2-$D42))","v":0},1,{"$f":"SUM(SUM(SUM(SUM($N42:$O42)/$I42*$P42)*Account!$Y$2)/100)","v":0},{"$f":"SUM(SUM(SUM(SUM($N42:$O42)/$I42*$Q42)*Account!$X$2)/100)","v":0},{"$f":"IF(Account!$AC$2=0,0,SUM(Account!$AC$2-$D42))","v":0},1,0,0,{"$f":"SUM($V42*Account!$AB$2)","v":0},{"$f":"SUM($W42*Account!$AA$2)","v":0},0]
[42,null,null,null,null,null,null,null,1,{"$f":"IF(Account!$AJ$2=0,0,SUM(Account!$AJ$2-$D43))","v":0},1,0,0,{"$f":"ROUND(SUM($L43*Account!$AI$2),2)","v":0},{"$f":"ROUND(SUM($M43*Account!$AH$2),2)","v":0},{"$f":"IF(Account!$Z$2=0,0,SUM(Account!$Z$2-$D43))","v":0},1,{"$f":"SUM(SUM(SUM(SUM($N43:$O43)/$I43*$P43)*Account!$Y$2)/100)","v":0},{"$f":"SUM(SUM(SUM(SUM($N43:$O43)/$I43*$Q43)*Account!$X$2)/100)","v":0},{"$f":"IF(Account!$AC$2=0,0,SUM(Account!$AC$2-$D43))","v":0},1,0,0,{"$f":"SUM($V43*Account!$AB$2)","v":0},{"$f":"SUM($W43*Account!$AA$2)","v":0},0]
[43,null,null,null,null,null,null,null,1,{"$f":"IF(Account!$AJ$2=0,0,SUM(Account!$AJ$2-$D44))","v":0},1,0,0,{"$f":"ROUND(SUM($L44*Account!$AI$2),2)","v":0},{"$f":"ROUND(SUM($M44*Account!$AH$2),2)","v":0},{"$f":"IF(Account!$Z$2=0,0,SUM(Account!$Z$2-$D44))","v":0},1,{"$f":"SUM(SUM(SUM(SUM($N44:$O44)/$I44*$P44)*Account!$Y$2)/100)","v":0},{"$f":"SUM(SUM(SUM(SUM($N44:$O44)/$I44*$Q44)*Account!$X$2)/100)","v":0},{"$f":"IF(Account!$AC$2=0,0,SUM(Account!$AC$2-$D44))","v":0},1,0,0,{"$f":"SUM($V44*Account!$AB$2)","v":0},{"$f":"SUM($W44*Account!$AA$2)","v":0},0]
[44,null,null,null,null,null,null,null,1,{"$f":"IF(Account!$AJ$2=0,0,SUM(Account!$AJ$2-$D45))","v":0},1,0,0,{"$f":"ROUND(SUM($L45*Account!$AI$2),2)","v":0},{"$f":"ROUND(SUM($M45*Account!$AH$2),2)","v":0},{"$f":"IF(Account!$Z$2=0,0,SUM(Account!$Z$2-$D45))","v":0},1,{"$f":"SUM(SUM(SUM(SUM($N45:$O45)/$I45*$P45)*Account!$Y$2)/100)","v":0},{"$f":"SUM(SUM(SUM(SUM($N45:$O45)/$I45*$Q45)*Account!$X$2)/100)","v":0},{"$f":"IF(Account!$AC$2=0,0,SUM(Account!$AC$2-$D45))","v":0},1,0,0,{"$f":"SUM($V45*Account!$AB$2)","v":0},{"$f":"SUM($W45*Account!$AA$2)","v":0},0]
[45,null,null,null,null,null,null,null,1,{"$f":"IF(Account!$AJ$2=0,0,SUM(Account!$AJ$2-$D46))","v":0},1,0,0,{"$f":"ROUND(SUM($L46*Account!$AI$2),2)","v":0},{"$f":"ROUND(SUM($M46*Account!$AH$2),2)","v":0},{"$f":"IF(Account!$Z$2=0,0,SUM(Account!$Z$2-$D46))","v":0},1,{"$f":"SUM(SUM(SUM(SUM($N46:$O46)/$I46*$P46)*Account!$Y$2)/100)","v":0},{"$f":"SUM(SUM(SUM(SUM($N46:$O46)/$I46*$Q46)*Account!$X$2)/100)","v":0},{"$f":"IF(Account!$AC$2=0,0,SUM(Account!$AC$2-$D46))","v":0},1,0,0,{"$f":"SUM($V46*Account!$AB$2)","v":0},{"$f":"SUM($W46*Account!$AA$2)","v":0},0]
[46,null,null,null,null,null,null,null,1,{"$f":"IF(Account!$AJ$2=0,0,SUM(Account!$AJ$2-$D47))","v":0},1,0,0,{"$f":"ROUND(SUM($L47*Account!$AI$2),2)","v":0},{"$f":"ROUND(SUM($M47*Account!$AH$2),2)","v":0},{"$f":"IF(Account!$Z$2=0,0,SUM(Account!$Z$2-$D47))","v":0},1,{"$f":"SUM(SUM(SUM(SUM($N47:$O47)/$I47*$P47)*Account!$Y$2)/100)","v":0},{"$f":"SUM(SUM(SUM(SUM($N47:$O47)/$I47*$Q47)*Account!$X$2)/100)","v":0},{"$f":"IF(Account!$AC$2=0,0,SUM(Account!$AC$2-$D47))","v":0},1,0,0,{"$f":"SUM($V47*Account!$AB$2)","v":0},{"$f":"SUM($W47*Account!$AA$2)","v":0},0]
[47,null,null,null,null,null,null,null,1,{"$f":"IF(Account!$AJ$2=0,0,SUM(Account!$AJ$2-$D48))","v":0},1,0,0,{"$f":"ROUND(SUM($L48*Account!$AI$2),2)","v":0},{"$f":"ROUND(SUM($M48*Account!$AH$2),2)","v":0},{"$f":"IF(Account!$Z$2=0,0,SUM(Account!$Z$2-$D48))","v":0},1,{"$f":"SUM(SUM(SUM(SUM($N48:$O48)/$I48*$P48)*Account!$Y$2)/100)","v":0},{"$f":"SUM(SUM(SUM(SUM($N48:$O48)/$I48*$Q48)*Account!$X$2)/100)","v":0},{"$f":"IF(Account!$AC$2=0,0,SUM(Account!$AC$2-$D48))","v":0},1,0,0,{"$f":"SUM($V48*Account!$AB$2)","v":0},{"$f":"SUM($W48*Account!$AA$2)","v":0},0]
[48,null,null,null,null,null,null,null,1,{"$f":"IF(Account!$AJ$2=0,0,SUM(Account!$AJ$2-$D49))","v":0},1,0,0,{"$f":"ROUND(SUM($L49*Account!$AI$2),2)","v":0},{"$f":"ROUND(SUM($M49*Account!$AH$2),2)","v":0},{"$f":"IF(Account!$Z$2=0,0,SUM(Account!$Z$2-$D49))","v":0},1,{"$f":"SUM(SUM(SUM(SUM($N49:$O49)/$I49*$P49)*Account!$Y$2)/100)","v":0},{"$f":"SUM(SUM(SUM(SUM($N49:$O49)/$I49*$Q49)*Account!$X$2)/100)","v":0},{"$f":"IF(Account!$AC$2=0,0,SUM(Account!$AC$2-$D49))","v":0},1,0,0,{"$f":"SUM($V49*Account!$AB$2)","v":0},{"$f":"SUM($W49*Account!$AA$2)","v":0},0]
[49,null,null,null,null,null,null,null,1,{"$f":"IF(Account!$AJ$2=0,0,SUM(Account!$AJ$2-$D50))","v":0},1,0,0,{"$f":"ROUND(SUM($L50*Account!$AI$2),2)","v":0},{"$f":"ROUND(SUM($M50*Account!$AH$2),2)","v":0},{"$f":"IF(Account!$Z$2=0,0,SUM(Account!$Z$2-$D50))","v":0},1,{"$f":"SUM(SUM(SUM(SUM($N50:$O50)/$I50*$P50)*Account!$Y$2)/100)","v":0},{"$f":"SUM(SUM(SUM(SUM($N50:$O50)/$I50*$Q50)*Account!$X$2)/100)","v":0},{"$f":"IF(Account!$AC$2=0,0,SUM(Account!$AC$2-$D50))","v":0},1,0,0,{"$f":"SUM($V50*Account!$AB$2)","v":0},{"$f":"SUM($W50*Account!$AA$2)","v":0},0]
[50,null,null,null,null,null,null,null,1,{"$f":"IF(Account!$AJ$2=0,0,SUM(Account!$AJ$2-$D51))","v":0},1,0,0,{"$f":"ROUND(SUM($L51*Account!$AI$2),2)","v":0},{"$f":"ROUND(SUM($M51*Account!$AH$2),2)","v":0},{"$f":"IF(Account!$Z$2=0,0,SUM(Account!$Z$2-$D51))","v":0},1,{"$f":"SUM(SUM(SUM(SUM($N51:$O51)/$I51*$P51)*Account!$Y$2)/100)","v":0},{"$f":"SUM(SUM(SUM(SUM($N51:$O51)/$I51*$Q51)*Account!$X$2)/100)","v":0},{"$f":"IF(Account!$AC$2=0,0,SUM(Account!$AC$2-$D51))","v":0},1,0,0,{"$f":"SUM($V51*Account!$AB$2)","v":0},{"$f":"SUM($W51*Account!$AA$2)","v":0},0]
[51,null,null,null,null,null,null,null,1,{"$f":"IF(Account!$AJ$2=0,0,SUM(Account!$AJ$2-$D52))","v":0},1,0,0,{"$f":"ROUND(SUM($L52*Account!$AI$2),2)","v":0},{"$f":"ROUND(SUM($M52*Account!$AH$2),2)","v":0},{"$f":"IF(Account!$Z$2=0,0,SUM(Account!$Z$2-$D52))","v":0},1,{"$f":"SUM(SUM(SUM(SUM($N52:$O52)/$I52*$P52)*Account!$Y$2)/100)","v":0},{"$f":"SUM(SUM(SUM(SUM($N52:$O52)/$I52*$Q52)*Account!$X$2)/100)","v":0},{"$f":"IF(Account!$AC$2=0,0,SUM(Account!$AC$2-$D52))","v":0},1,0,0,{"$f":"SUM($V52*Account!$AB$2)","v":0},{"$f":"SUM($W52*Account!$AA$2)","v":0},0]
[52,null,null,null,null,null,null,null,1,{"$f":"IF(Account!$AJ$2=0,0,SUM(Account!$AJ$2-$D53))","v":0},1,0,0,{"$f":"ROUND(SUM($L53*Account!$AI$2),2)","v":0},{"$f":"ROUND(SUM($M53*Account!$AH$2),2)","v":0},{"$f":"IF(Account!$Z$2=0,0,SUM(Account!$Z$2-$D53))","v":0},1,{"$f":"SUM(SUM(SUM(SUM($N53:$O53)/$I53*$P53)*Account!$Y$2)/100)","v":0},{"$f":"SUM(SUM(SUM(SUM($N53:$O53)/$I53*$Q53)*Account!$X$2)/100)","v":0},{"$f":"IF(Account!$AC$2=0,0,SUM(Account!$AC$2-$D53))","v":0},1,0,0,{"$f":"SUM($V53*Account!$AB$2)","v":0},{"$f":"SUM($W53*Account!$AA$2)","v":0},0]
[53,null,null,null,null,null,null,null,1,{"$f":"IF(Account!$AJ$2=0,0,SUM(Account!$AJ$2-$D54))","v":0},1,0,0,{"$f":"ROUND(SUM($L54*Account!$AI$2),2)","v":0},{"$f":"ROUND(SUM($M54*Account!$AH$2),2)","v":0},{"$f":"IF(Account!$Z$2=0,0,SUM(Account!$Z$2-$D54))","v":0},1,{"$f":"SUM(SUM(SUM(SUM($N54:$O54)/$I54*$P54)*Account!$Y$2)/100)","v":0},{"$f":"SUM(SUM(SUM(SUM($N54:$O54)/$I54*$Q54)*Account!$X$2)/100)","v":0},{"$f":"IF(Account!$AC$2=0,0,SUM(Account!$AC$2-$D54))","v":0},1,0,0,{"$f":"SUM($V54*Account!$AB$2)","v":0},{"$f":"SUM($W54*Account!$AA$2)","v":0},0]
[54,null,null,null,null,null,null,null,1,{"$f":"IF(Account!$AJ$2=0,0,SUM(Account!$AJ$2-$D55))","v":0},1,0,0,{"$f":"ROUND(SUM($L55*Account!$AI$2),2)","v":0},{"$f":"ROUND(SUM($M55*Account!$AH$2),2)","v":0},{"$f":"IF(Account!$Z$2=0,0,SUM(Account!$Z$2-$D55))","v":0},1,{"$f":"SUM(SUM(SUM(SUM($N55:$O55)/$I55*$P55)*Account!$Y$2)/100)","v":0},{"$f":"SUM(SUM(SUM(SUM($N55:$O55)/$I55*$Q55)*Account!$X$2)/100)","v":0},{"$f":"IF(Account!$AC$2=0,0,SUM(Account!$AC$2-$D55))","v":0},1,0,0,{"$f":"SUM($V55*Account!$AB$2)","v":0},{"$f":"SUM($W55*Account!$AA$2)","v":0},0]
[55,null,null,null,null,null,null,null,1,{"$f":"IF(Account!$AJ$2=0,0,SUM(Account!$AJ$2-$D56))","v":0},1,0,0,{"$f":"ROUND(SUM($L56*Account!$AI$2),2)","v":0},{"$f":"ROUND(SUM($M56*Account!$AH$2),2)","v":0},{"$f":"IF(Account!$Z$2=0,0,SUM(Account!$Z$2-$D56))","v":0},1,{"$f":"SUM(SUM(SUM(SUM($N56:$O56)/$I56*$P56)*Account!$Y$2)/100)","v":0},{"$f":"SUM(SUM(SUM(SUM($N56:$O56)/$I56*$Q56)*Account!$X$2)/100)","v":0},{"$f":"IF(Account!$AC$2=0,0,SUM(Account!$AC$2-$D56))","v":0},1,0,0,{"$f":"SUM($V56*Account!$AB$2)","v":0},{"$f":"SUM($W56*Account!$AA$2)","v":0},0]
[56,null,null,null,null,null,null,null,1,{"$f":"IF(Account!$AJ$2=0,0,SUM(Account!$AJ$2-$D57))","v":0},1,0,0,{"$f":"ROUND(SUM($L57*Account!$AI$2),2)","v":0},{"$f":"ROUND(SUM($M57*Account!$AH$2),2)","v":0},{"$f":"IF(Account!$Z$2=0,0,SUM(Account!$Z$2-$D57))","v":0},1,{"$f":"SUM(SUM(SUM(SUM($N57:$O57)/$I57*$P57)*Account!$Y$2)/100)","v":0},{"$f":"SUM(SUM(SUM(SUM($N57:$O57)/$I57*$Q57)*Account!$X$2)/100)","v":0},{"$f":"IF(Account!$AC$2=0,0,SUM(Account!$AC$2-$D57))","v":0},1,0,0,{"$f":"SUM($V57*Account!$AB$2)","v":0},{"$f":"SUM($W57*Account!$AA$2)","v":0},0]
[57,null,null,null,null,null,null,null,1,{"$f":"IF(Account!$AJ$2=0,0,SUM(Account!$AJ$2-$D58))","v":0},1,0,0,{"$f":"ROUND(SUM($L58*Account!$AI$2),2)","v":0},{"$f":"ROUND(SUM($M58*Account!$AH$2),2)","v":0},{"$f":"IF(Account!$Z$2=0,0,SUM(Account!$Z$2-$D58))","v":0},1,{"$f":"SUM(SUM(SUM(SUM($N58:$O58)/$I58*$P58)*Account!$Y$2)/100)","v":0},{"$f":"SUM(SUM(SUM(SUM($N58:$O58)/$I58*$Q58)*Account!$X$2)/100)","v":0},{"$f":"IF(Account!$AC$2=0,0,SUM(Account!$AC$2-$D58))","v":0},1,0,0,{"$f":"SUM($V58*Account!$AB$2)","v":0},{"$f":"SUM($W58*Account!$AA$2)","v":0},0]
[58,null,null,null,null,null,null,null,1,{"$f":"IF(Account!$AJ$2=0,0,SUM(Account!$AJ$2-$D59))","v":0},1,0,0,{"$f":"ROUND(SUM($L59*Account!$AI$2),2)","v":0},{"$f":"ROUND(SUM($M59*Account!$AH$2),2)","v":0},{"$f":"IF(Account!$Z$2=0,0,SUM(Account!$Z$2-$D59))","v":0},1,{"$f":"SUM(SUM(SUM(SUM($N59:$O59)/$I59*$P59)*Account!$Y$2)/100)","v":0},{"$f":"SUM(SUM(SUM(SUM($N59:$O59)/$I59*$Q59)*Account!$X$2)/100)","v":0},{"$f":"IF(Account!$AC$2=0,0,SUM(Account!$AC$2-$D59))","v":0},1,0,0,{"$f":"SUM($V59*Account!$AB$2)","v":0},{"$f":"SUM($W59*Account!$AA$2)","v":0},0]
[59,null,null,null,null,null,null,null,1,{"$f":"IF(Account!$AJ$2=0,0,SUM(Account!$AJ$2-$D60))","v":0},1,0,0,{"$f":"ROUND(SUM($L60*Account!$AI$2),2)","v":0},{"$f":"ROUND(SUM($M60*Account!$AH$2),2)","v":0},{"$f":"IF(Account!$Z$2=0,0,SUM(Account!$Z$2-$D60))","v":0},1,{"$f":"SUM(SUM(SUM(SUM($N60:$O60)/$I60*$P60)*Account!$Y$2)/100)","v":0},{"$f":"SUM(SUM(SUM(SUM($N60:$O60)/$I60*$Q60)*Account!$X$2)/100)","v":0},{"$f":"IF(Account!$AC$2=0,0,SUM(Account!$AC$2-$D60))","v":0},1,0,0,{"$f":"SUM($V60*Account!$AB$2)","v":0},{"$f":"SUM($W60*Account!$AA$2)","v":0},0]
[60,null,null,null,null,null,null,null,1,{"$f":"IF(Account!$AJ$2=0,0,SUM(Account!$AJ$2-$D61))","v":0},1,0,0,{"$f":"ROUND(SUM($L61*Account!$AI$2),2)","v":0},{"$f":"ROUND(SUM($M61*Account!$AH$2),2)","v":0},{"$f":"IF(Account!$Z$2=0,0,SUM(Account!$Z$2-$D61))","v":0},1,{"$f":"SUM(SUM(SUM(SUM($N61:$O61)/$I61*$P61)*Account!$Y$2)/100)","v":0},{"$f":"SUM(SUM(SUM(SUM($N61:$O61)/$I61*$Q61)*Account!$X$2)/100)","v":0},{"$f":"IF(Account!$AC$2=0,0,SUM(Account!$AC$2-$D61))","v":0},1,0,0,{"$f":"SUM($V61*Account!$AB$2)","v":0},{"$f":"SUM($W61*Account!$AA$2)","v":0},0]
[61,null,null,null,null,null,null,null,1,{"$f":"IF(Account!$AJ$2=0,0,SUM(Account!$AJ$2-$D62))","v":0},1,0,0,{"$f":"ROUND(SUM($L62*Account!$AI$2),2)","v":0},{"$f":"ROUND(SUM($M62*Account!$AH$2),2)","v":0},{"$f":"IF(Account!$Z$2=0,0,SUM(Account!$Z$2-$D62))","v":0},1,{"$f":"SUM(SUM(SUM(SUM($N62:$O62)/$I62*$P62)*Account!$Y$2)/100)","v":0},{"$f":"SUM(SUM(SUM(SUM($N62:$O62)/$I62*$Q62)*Account!$X$2)/100)","v":0},{"$f":"IF(Account!$AC$2=0,0,SUM(Account!$AC$2-$D62))","v":0},1,0,0,{"$f":"SUM($V62*Account!$AB$2)","v":0},{"$f":"SUM($W62*Account!$AA$2)","v":0},0]
[62,null,null,null,null,null,null,null,1,{"$f":"IF(Account!$AJ$2=0,0,SUM(Account!$AJ$2-$D63))","v":0},1,0,0,{"$f":"ROUND(SUM($L63*Account!$AI$2),2)","v":0},{"$f":"ROUND(SUM($M63*Account!$AH$2),2)","v":0},{"$f":"IF(Account!$Z$2=0,0,SUM(Account!$Z$2-$D63))","v":0},1,{"$f":"SUM(SUM(SUM(SUM($N63:$O63)/$I63*$P63)*Account!$Y$2)/100)","v":0},{"$f":"SUM(SUM(SUM(SUM($N63:$O63)/$I63*$Q63)*Account!$X$2)/100)","v":0},{"$f":"IF(Account!$AC$2=0,0,SUM(Account!$AC$2-$D63))","v":0},1,0,0,{"$f":"SUM($V63*Account!$AB$2)","v":0},{"$f":"SUM($W63*Account!$AA$2)","v":0},0]
[63,null,null,null,null,null,null,null,1,{"$f":"IF(Account!$AJ$2=0,0,SUM(Account!$AJ$2-$D64))","v":0},1,0,0,{"$f":"ROUND(SUM($L64*Account!$AI$2),2)","v":0},{"$f":"ROUND(SUM($M64*Account!$AH$2),2)","v":0},{"$f":"IF(Account!$Z$2=0,0,SUM(Account!$Z$2-$D64))","v":0},1,{"$f":"SUM(SUM(SUM(SUM($N64:$O64)/$I64*$P64)*Account!$Y$2)/100)","v":0},{"$f":"SUM(SUM(SUM(SUM($N64:$O64)/$I64*$Q64)*Account!$X$2)/100)","v":0},{"$f":"IF(Account!$AC$2=0,0,SUM(Account!$AC$2-$D64))","v":0},1,0,0,{"$f":"SUM($V64*Account!$AB$2)","v":0},{"$f":"SUM($W64*Account!$AA$2)","v":0},0]
[64,null,null,null,null,null,null,null,1,{"$f":"IF(Account!$AJ$2=0,0,SUM(Account!$AJ$2-$D65))","v":0},1,0,0,{"$f":"ROUND(SUM($L65*Account!$AI$2),2)","v":0},{"$f":"ROUND(SUM($M65*Account!$AH$2),2)","v":0},{"$f":"IF(Account!$Z$2=0,0,SUM(Account!$Z$2-$D65))","v":0},1,{"$f":"SUM(SUM(SUM(SUM($N65:$O65)/$I65*$P65)*Account!$Y$2)/100)","v":0},{"$f":"SUM(SUM(SUM(SUM($N65:$O65)/$I65*$Q65)*Account!$X$2)/100)","v":0},{"$f":"IF(Account!$AC$2=0,0,SUM(Account!$AC$2-$D65))","v":0},1,0,0,{"$f":"SUM($V65*Account!$AB$2)","v":0},{"$f":"SUM($W65*Account!$AA$2)","v":0},0]
[65,null,null,null,null,null,null,null,1,{"$f":"IF(Account!$AJ$2=0,0,SUM(Account!$AJ$2-$D66))","v":0},{"$f":"SUM($I66-$J66)","v":1},0,0,{"$f":"ROUND(SUM($L66*Account!$AI$2),2)","v":0},{"$f":"ROUND(SUM($M66*Account!$AH$2),2)","v":0},{"$f":"IF(Account!$Z$2=0,0,SUM(Account!$Z$2-$D66))","v":0},{"$f":"SUM($I66-$P66)","v":1},{"$f":"SUM(SUM(SUM(SUM($N66:$O66)/$I66*$P66)*Account!$Y$2)/100)","v":0},{"$f":"SUM(SUM(SUM(SUM($N66:$O66)/$I66*$Q66)*Account!$X$2)/100)","v":0},{"$f":"IF(Account!$AC$2=0,0,SUM(Account!$AC$2-$D66))","v":0},{"$f":"SUM($I66-$T66)","v":1},0,0,{"$f":"SUM($V66*Account!$AB$2)","v":0},{"$f":"SUM($W66*Account!$AA$2)","v":0},0]
[66,null,null,null,null,null,null,null,{"$f":"SUM($E67-$D67+1)","v":1},{"$f":"IF(Account!$AJ$2=0,0,SUM(Account!$AJ$2-$D67))","v":0},1,{"$f":"ROUND(IF($J67=0,0,SUM($H67/$I67*$K67)),2)","v":0},{"$f":"ROUND(SUM($H67-$L67),2)","v":0},{"$f":"ROUND(SUM($L67*Account!$AI$2),2)","v":0},{"$f":"ROUND(SUM($M67*Account!$AH$2),2)","v":0},{"$f":"IF(Account!$Z$2=0,0,SUM(Account!$Z$2-$D67))","v":0},1,{"$f":"SUM(SUM(SUM(SUM($N67:$O67)/$I67*$P67)*Account!$Y$2)/100)","v":0},{"$f":"SUM(SUM(SUM(SUM($N67:$O67)/$I67*$Q67)*Account!$X$2)/100)","v":0},{"$f":"IF(Account!$AC$2=0,0,SUM(Account!$AC$2-$D67))","v":0},1,{"$f":"ROUND(IF($T67=0,0,SUM($H67/$I67*$T67)),2)","v":0},{"$f":"ROUND(SUM($H67-$V67),2)","v":0},{"$f":"SUM($V67*Account!$AB$2)","v":0},{"$f":"SUM($W67*Account!$AA$2)","v":0},{"$f":"SUM($N67:$O67,$R67:$S67,$X67:$Y67)","v":0}]
[67,null,null,null,null,null,null,null,1,{"$f":"IF(Account!$AJ$2=0,0,SUM(Account!$AJ$2-$D68))","v":0},1,0,0,{"$f":"ROUND(SUM($L68*Account!$AI$2),2)","v":0},{"$f":"ROUND(SUM($M68*Account!$AH$2),2)","v":0},{"$f":"IF(Account!$Z$2=0,0,SUM(Account!$Z$2-$D68))","v":0},1,{"$f":"SUM(SUM(SUM(SUM($N68:$O68)/$I68*$P68)*Account!$Y$2)/100)","v":0},{"$f":"SUM(SUM(SUM(SUM($N68:$O68)/$I68*$Q68)*Account!$X$2)/100)","v":0},{"$f":"IF(Account!$AC$2=0,0,SUM(Account!$AC$2-$D68))","v":0},1,0,0,{"$f":"SUM($V68*Account!$AB$2)","v":0},{"$f":"SUM($W68*Account!$AA$2)","v":0},0]
[68,null,null,null,null,null,null,null,1,{"$f":"IF(Account!$AJ$2=0,0,SUM(Account!$AJ$2-$D69))","v":0},1,0,0,{"$f":"ROUND(SUM($L69*Account!$AI$2),2)","v":0},{"$f":"ROUND(SUM($M69*Account!$AH$2),2)","v":0},{"$f":"IF(Account!$Z$2=0,0,SUM(Account!$Z$2-$D69))","v":0},1,{"$f":"SUM(SUM(SUM(SUM($N69:$O69)/$I69*$P69)*Account!$Y$2)/100)","v":0},{"$f":"SUM(SUM(SUM(SUM($N69:$O69)/$I69*$Q69)*Account!$X$2)/100)","v":0},{"$f":"IF(Account!$AC$2=0,0,SUM(Account!$AC$2-$D69))","v":0},1,0,0,{"$f":"SUM($V69*Account!$AB$2)","v":0},{"$f":"SUM($W69*Account!$AA$2)","v":0},0]
[69,null,null,null,null,null,null,null,1,{"$f":"IF(Account!$AJ$2=0,0,SUM(Account!$AJ$2-$D70))","v":0},1,0,0,{"$f":"ROUND(SUM($L70*Account!$AI$2),2)","v":0},{"$f":"ROUND(SUM($M70*Account!$AH$2),2)","v":0},{"$f":"IF(Account!$Z$2=0,0,SUM(Account!$Z$2-$D70))","v":0},1,{"$f":"SUM(SUM(SUM(SUM($N70:$O70)/$I70*$P70)*Account!$Y$2)/100)","v":0},{"$f":"SUM(SUM(SUM(SUM($N70:$O70)/$I70*$Q70)*Account!$X$2)/100)","v":0},{"$f":"IF(Account!$AC$2=0,0,SUM(Account!$AC$2-$D70))","v":0},1,0,0,{"$f":"SUM($V70*Account!$AB$2)","v":0},{"$f":"SUM($W70*Account!$AA$2)","v":0},0]
[70,null,null,null,null,null,null,null,1,{"$f":"IF(Account!$AJ$2=0,0,SUM(Account!$AJ$2-$D71))","v":0},1,0,0,{"$f":"ROUND(SUM($L71*Account!$AI$2),2)","v":0},{"$f":"ROUND(SUM($M71*Account!$AH$2),2)","v":0},{"$f":"IF(Account!$Z$2=0,0,SUM(Account!$Z$2-$D71))","v":0},1,{"$f":"SUM(SUM(SUM(SUM($N71:$O71)/$I71*$P71)*Account!$Y$2)/100)","v":0},{"$f":"SUM(SUM(SUM(SUM($N71:$O71)/$I71*$Q71)*Account!$X$2)/100)","v":0},{"$f":"IF(Account!$AC$2=0,0,SUM(Account!$AC$2-$D71))","v":0},1,0,0,{"$f":"SUM($V71*Account!$AB$2)","v":0},{"$f":"SUM($W71*Account!$AA$2)","v":0},0]
[71,null,null,null,null,null,null,null,1,{"$f":"IF(Account!$AJ$2=0,0,SUM(Account!$AJ$2-$D72))","v":0},1,0,0,{"$f":"ROUND(SUM($L72*Account!$AI$2),2)","v":0},{"$f":"ROUND(SUM($M72*Account!$AH$2),2)","v":0},{"$f":"IF(Account!$Z$2=0,0,SUM(Account!$Z$2-$D72))","v":0},1,{"$f":"SUM(SUM(SUM(SUM($N72:$O72)/$I72*$P72)*Account!$Y$2)/100)","v":0},{"$f":"SUM(SUM(SUM(SUM($N72:$O72)/$I72*$Q72)*Account!$X$2)/100)","v":0},{"$f":"IF(Account!$AC$2=0,0,SUM(Account!$AC$2-$D72))","v":0},1,0,0,{"$f":"SUM($V72*Account!$AB$2)","v":0},{"$f":"SUM($W72*Account!$AA$2)","v":0},0]
[72,null,null,null,null,null,null,null,1,{"$f":"IF(Account!$AJ$2=0,0,SUM(Account!$AJ$2-$D73))","v":0},1,0,0,{"$f":"ROUND(SUM($L73*Account!$AI$2),2)","v":0},{"$f":"ROUND(SUM($M73*Account!$AH$2),2)","v":0},{"$f":"IF(Account!$Z$2=0,0,SUM(Account!$Z$2-$D73))","v":0},1,{"$f":"SUM(SUM(SUM(SUM($N73:$O73)/$I73*$P73)*Account!$Y$2)/100)","v":0},{"$f":"SUM(SUM(SUM(SUM($N73:$O73)/$I73*$Q73)*Account!$X$2)/100)","v":0},{"$f":"IF(Account!$AC$2=0,0,SUM(Account!$AC$2-$D73))","v":0},1,0,0,{"$f":"SUM($V73*Account!$AB$2)","v":0},{"$f":"SUM($W73*Account!$AA$2)","v":0},0]
[73,null,null,null,null,null,null,null,1,{"$f":"IF(Account!$AJ$2=0,0,SUM(Account!$AJ$2-$D74))","v":0},1,0,0,{"$f":"ROUND(SUM($L74*Account!$AI$2),2)","v":0},{"$f":"ROUND(SUM($M74*Account!$AH$2),2)","v":0},{"$f":"IF(Account!$Z$2=0,0,SUM(Account!$Z$2-$D74))","v":0},1,{"$f":"SUM(SUM(SUM(SUM($N74:$O74)/$I74*$P74)*Account!$Y$2)/100)","v":0},{"$f":"SUM(SUM(SUM(SUM($N74:$O74)/$I74*$Q74)*Account!$X$2)/100)","v":0},{"$f":"IF(Account!$AC$2=0,0,SUM(Account!$AC$2-$D74))","v":0},1,0,0,{"$f":"SUM($V74*Account!$AB$2)","v":0},{"$f":"SUM($W74*Account!$AA$2)","v":0},0]
[74,null,null,null,null,null,null,null,1,{"$f":"IF(Account!$AJ$2=0,0,SUM(Account!$AJ$2-$D75))","v":0},1,0,0,{"$f":"ROUND(SUM($L75*Account!$AI$2),2)","v":0},{"$f":"ROUND(SUM($M75*Account!$AH$2),2)","v":0},{"$f":"IF(Account!$Z$2=0,0,SUM(Account!$Z$2-$D75))","v":0},1,{"$f":"SUM(SUM(SUM(SUM($N75:$O75)/$I75*$P75)*Account!$Y$2)/100)","v":0},{"$f":"SUM(SUM(SUM(SUM($N75:$O75)/$I75*$Q75)*Account!$X$2)/100)","v":0},{"$f":"IF(Account!$AC$2=0,0,SUM(Account!$AC$2-$D75))","v":0},1,0,0,{"$f":"SUM($V75*Account!$AB$2)","v":0},{"$f":"SUM($W75*Account!$AA$2)","v":0},0]
[75,null,null,null,null,null,null,null,1,{"$f":"IF(Account!$AJ$2=0,0,SUM(Account!$AJ$2-$D76))","v":0},1,0,0,{"$f":"ROUND(SUM($L76*Account!$AI$2),2)","v":0},{"$f":"ROUND(SUM($M76*Account!$AH$2),2)","v":0},{"$f":"IF(Account!$Z$2=0,0,SUM(Account!$Z$2-$D76))","v":0},1,{"$f":"SUM(SUM(SUM(SUM($N76:$O76)/$I76*$P76)*Account!$Y$2)/100)","v":0},{"$f":"SUM(SUM(SUM(SUM($N76:$O76)/$I76*$Q76)*Account!$X$2)/100)","v":0},{"$f":"IF(Account!$AC$2=0,0,SUM(Account!$AC$2-$D76))","v":0},1,0,0,{"$f":"SUM($V76*Account!$AB$2)","v":0},{"$f":"SUM($W76*Account!$AA$2)","v":0},0]
[76,null,null,null,null,null,null,null,1,{"$f":"IF(Account!$AJ$2=0,0,SUM(Account!$AJ$2-$D77))","v":0},1,0,0,{"$f":"ROUND(SUM($L77*Account!$AI$2),2)","v":0},{"$f":"ROUND(SUM($M77*Account!$AH$2),2)","v":0},{"$f":"IF(Account!$Z$2=0,0,SUM(Account!$Z$2-$D77))","v":0},1,{"$f":"SUM(SUM(SUM(SUM($N77:$O77)/$I77*$P77)*Account!$Y$2)/100)","v":0},{"$f":"SUM(SUM(SUM(SUM($N77:$O77)/$I77*$Q77)*Account!$X$2)/100)","v":0},{"$f":"IF(Account!$AC$2=0,0,SUM(Account!$AC$2-$D77))","v":0},1,0,0,{"$f":"SUM($V77*Account!$AB$2)","v":0},{"$f":"SUM($W77*Account!$AA$2)","v":0},0]
[77,null,null,null,null,null,null,null,1,{"$f":"IF(Account!$AJ$2=0,0,SUM(Account!$AJ$2-$D78))","v":0},1,0,0,{"$f":"ROUND(SUM($L78*Account!$AI$2),2)","v":0},{"$f":"ROUND(SUM($M78*Account!$AH$2),2)","v":0},{"$f":"IF(Account!$Z$2=0,0,SUM(Account!$Z$2-$D78))","v":0},1,{"$f":"SUM(SUM(SUM(SUM($N78:$O78)/$I78*$P78)*Account!$Y$2)/100)","v":0},{"$f":"SUM(SUM(SUM(SUM($N78:$O78)/$I78*$Q78)*Account!$X$2)/100)","v":0},{"$f":"IF(Account!$AC$2=0,0,SUM(Account!$AC$2-$D78))","v":0},1,0,0,{"$f":"SUM($V78*Account!$AB$2)","v":0},{"$f":"SUM($W78*Account!$AA$2)","v":0},0]
[78,null,null,null,null,null,null,null,1,{"$f":"IF(Account!$AJ$2=0,0,SUM(Account!$AJ$2-$D79))","v":0},1,0,0,{"$f":"ROUND(SUM($L79*Account!$AI$2),2)","v":0},{"$f":"ROUND(SUM($M79*Account!$AH$2),2)","v":0},{"$f":"IF(Account!$Z$2=0,0,SUM(Account!$Z$2-$D79))","v":0},1,{"$f":"SUM(SUM(SUM(SUM($N79:$O79)/$I79*$P79)*Account!$Y$2)/100)","v":0},{"$f":"SUM(SUM(SUM(SUM($N79:$O79)/$I79*$Q79)*Account!$X$2)/100)","v":0},{"$f":"IF(Account!$AC$2=0,0,SUM(Account!$AC$2-$D79))","v":0},1,0,0,{"$f":"SUM($V79*Account!$AB$2)","v":0},{"$f":"SUM($W79*Account!$AA$2)","v":0},0]
[79,null,null,null,null,null,null,null,1,{"$f":"IF(Account!$AJ$2=0,0,SUM(Account!$AJ$2-$D80))","v":0},1,0,0,{"$f":"ROUND(SUM($L80*Account!$AI$2),2)","v":0},{"$f":"ROUND(SUM($M80*Account!$AH$2),2)","v":0},{"$f":"IF(Account!$Z$2=0,0,SUM(Account!$Z$2-$D80))","v":0},1,{"$f":"SUM(SUM(SUM(SUM($N80:$O80)/$I80*$P80)*Account!$Y$2)/100)","v":0},{"$f":"SUM(SUM(SUM(SUM($N80:$O80)/$I80*$Q80)*Account!$X$2)/100)","v":0},{"$f":"IF(Account!$AC$2=0,0,SUM(Account!$AC$2-$D80))","v":0},1,0,0,{"$f":"SUM($V80*Account!$AB$2)","v":0},{"$f":"SUM($W80*Account!$AA$2)","v":0},0]
[80,null,null,null,null,null,null,null,1,{"$f":"IF(Account!$AJ$2=0,0,SUM(Account!$AJ$2-$D81))","v":0},1,0,0,{"$f":"ROUND(SUM($L81*Account!$AI$2),2)","v":0},{"$f":"ROUND(SUM($M81*Account!$AH$2),2)","v":0},{"$f":"IF(Account!$Z$2=0,0,SUM(Account!$Z$2-$D81))","v":0},1,{"$f":"SUM(SUM(SUM(SUM($N81:$O81)/$I81*$P81)*Account!$Y$2)/100)","v":0},{"$f":"SUM(SUM(SUM(SUM($N81:$O81)/$I81*$Q81)*Account!$X$2)/100)","v":0},{"$f":"IF(Account!$AC$2=0,0,SUM(Account!$AC$2-$D81))","v":0},1,0,0,{"$f":"SUM($V81*Account!$AB$2)","v":0},{"$f":"SUM($W81*Account!$AA$2)","v":0},0]
[81,null,null,null,null,null,null,null,1,{"$f":"IF(Account!$AJ$2=0,0,SUM(Account!$AJ$2-$D82))","v":0},1,0,0,{"$f":"ROUND(SUM($L82*Account!$AI$2),2)","v":0},{"$f":"ROUND(SUM($M82*Account!$AH$2),2)","v":0},{"$f":"IF(Account!$Z$2=0,0,SUM(Account!$Z$2-$D82))","v":0},1,{"$f":"SUM(SUM(SUM(SUM($N82:$O82)/$I82*$P82)*Account!$Y$2)/100)","v":0},{"$f":"SUM(SUM(SUM(SUM($N82:$O82)/$I82*$Q82)*Account!$X$2)/100)","v":0},{"$f":"IF(Account!$AC$2=0,0,SUM(Account!$AC$2-$D82))","v":0},1,0,0,{"$f":"SUM($V82*Account!$AB$2)","v":0},{"$f":"SUM($W82*Account!$AA$2)","v":0},0]
[82,null,null,null,null,null,null,null,1,{"$f":"IF(Account!$AJ$2=0,0,SUM(Account!$AJ$2-$D83))","v":0},1,0,0,{"$f":"ROUND(SUM($L83*Account!$AI$2),2)","v":0},{"$f":"ROUND(SUM($M83*Account!$AH$2),2)","v":0},{"$f":"IF(Account!$Z$2=0,0,SUM(Account!$Z$2-$D83))","v":0},1,{"$f":"SUM(SUM(SUM(SUM($N83:$O83)/$I83*$P83)*Account!$Y$2)/100)","v":0},{"$f":"SUM(SUM(SUM(SUM($N83:$O83)/$I83*$Q83)*Account!$X$2)/100)","v":0},{"$f":"IF(Account!$AC$2=0,0,SUM(Account!$AC$2-$D83))","v":0},1,0,0,{"$f":"SUM($V83*Account!$AB$2)","v":0},{"$f":"SUM($W83*Account!$AA$2)","v":0},0]
[83,null,null,null,null,null,null,null,1,{"$f":"IF(Account!$AJ$2=0,0,SUM(Account!$AJ$2-$D84))","v":0},1,0,0,{"$f":"ROUND(SUM($L84*Account!$AI$2),2)","v":0},{"$f":"ROUND(SUM($M84*Account!$AH$2),2)","v":0},{"$f":"IF(Account!$Z$2=0,0,SUM(Account!$Z$2-$D84))","v":0},1,{"$f":"SUM(SUM(SUM(SUM($N84:$O84)/$I84*$P84)*Account!$Y$2)/100)","v":0},{"$f":"SUM(SUM(SUM(SUM($N84:$O84)/$I84*$Q84)*Account!$X$2)/100)","v":0},{"$f":"IF(Account!$AC$2=0,0,SUM(Account!$AC$2-$D84))","v":0},1,0,0,{"$f":"SUM($V84*Account!$AB$2)","v":0},{"$f":"SUM($W84*Account!$AA$2)","v":0},0]
[84,null,null,null,null,null,null,null,1,{"$f":"IF(Account!$AJ$2=0,0,SUM(Account!$AJ$2-$D85))","v":0},1,0,0,{"$f":"ROUND(SUM($L85*Account!$AI$2),2)","v":0},{"$f":"ROUND(SUM($M85*Account!$AH$2),2)","v":0},{"$f":"IF(Account!$Z$2=0,0,SUM(Account!$Z$2-$D85))","v":0},1,{"$f":"SUM(SUM(SUM(SUM($N85:$O85)/$I85*$P85)*Account!$Y$2)/100)","v":0},{"$f":"SUM(SUM(SUM(SUM($N85:$O85)/$I85*$Q85)*Account!$X$2)/100)","v":0},{"$f":"IF(Account!$AC$2=0,0,SUM(Account!$AC$2-$D85))","v":0},1,0,0,{"$f":"SUM($V85*Account!$AB$2)","v":0},{"$f":"SUM($W85*Account!$AA$2)","v":0},0]
[85,null,null,null,null,null,null,null,1,{"$f":"IF(Account!$AJ$2=0,0,SUM(Account!$AJ$2-$D86))","v":0},1,0,0,{"$f":"ROUND(SUM($L86*Account!$AI$2),2)","v":0},{"$f":"ROUND(SUM($M86*Account!$AH$2),2)","v":0},{"$f":"IF(Account!$Z$2=0,0,SUM(Account!$Z$2-$D86))","v":0},1,{"$f":"SUM(SUM(SUM(SUM($N86:$O86)/$I86*$P86)*Account!$Y$2)/100)","v":0},{"$f":"SUM(SUM(SUM(SUM($N86:$O86)/$I86*$Q86)*Account!$X$2)/100)","v":0},{"$f":"IF(Account!$AC$2=0,0,SUM(Account!$AC$2-$D86))","v":0},1,0,0,{"$f":"SUM($V86*Account!$AB$2)","v":0},{"$f":"SUM($W86*Account!$AA$2)","v":0},0]
[86,null,null,null,null,null,null,null,1,{"$f":"IF(Account!$AJ$2=0,0,SUM(Account!$AJ$2-$D87))","v":0},1,0,0,{"$f":"ROUND(SUM($L87*Account!$AI$2),2)","v":0},{"$f":"ROUND(SUM($M87*Account!$AH$2),2)","v":0},{"$f":"IF(Account!$Z$2=0,0,SUM(Account!$Z$2-$D87))","v":0},1,{"$f":"SUM(SUM(SUM(SUM($N87:$O87)/$I87*$P87)*Account!$Y$2)/100)","v":0},{"$f":"SUM(SUM(SUM(SUM($N87:$O87)/$I87*$Q87)*Account!$X$2)/100)","v":0},{"$f":"IF(Account!$AC$2=0,0,SUM(Account!$AC$2-$D87))","v":0},1,0,0,{"$f":"SUM($V87*Account!$AB$2)","v":0},{"$f":"SUM($W87*Account!$AA$2)","v":0},0]
[87,null,null,null,null,null,null,null,1,{"$f":"IF(Account!$AJ$2=0,0,SUM(Account!$AJ$2-$D88))","v":0},1,0,0,{"$f":"ROUND(SUM($L88*Account!$AI$2),2)","v":0},{"$f":"ROUND(SUM($M88*Account!$AH$2),2)","v":0},{"$f":"IF(Account!$Z$2=0,0,SUM(Account!$Z$2-$D88))","v":0},1,{"$f":"SUM(SUM(SUM(SUM($N88:$O88)/$I88*$P88)*Account!$Y$2)/100)","v":0},{"$f":"SUM(SUM(SUM(SUM($N88:$O88)/$I88*$Q88)*Account!$X$2)/100)","v":0},{"$f":"IF(Account!$AC$2=0,0,SUM(Account!$AC$2-$D88))","v":0},1,0,0,{"$f":"SUM($V88*Account!$AB$2)","v":0},{"$f":"SUM($W88*Account!$AA$2)","v":0},0]
[88,null,null,null,null,null,null,null,1,{"$f":"IF(Account!$AJ$2=0,0,SUM(Account!$AJ$2-$D89))","v":0},1,0,0,{"$f":"ROUND(SUM($L89*Account!$AI$2),2)","v":0},{"$f":"ROUND(SUM($M89*Account!$AH$2),2)","v":0},{"$f":"IF(Account!$Z$2=0,0,SUM(Account!$Z$2-$D89))","v":0},1,{"$f":"SUM(SUM(SUM(SUM($N89:$O89)/$I89*$P89)*Account!$Y$2)/100)","v":0},{"$f":"SUM(SUM(SUM(SUM($N89:$O89)/$I89*$Q89)*Account!$X$2)/100)","v":0},{"$f":"IF(Account!$AC$2=0,0,SUM(Account!$AC$2-$D89))","v":0},1,0,0,{"$f":"SUM($V89*Account!$AB$2)","v":0},{"$f":"SUM($W89*Account!$AA$2)","v":0},0]
[89,null,null,null,null,null,null,null,1,{"$f":"IF(Account!$AJ$2=0,0,SUM(Account!$AJ$2-$D90))","v":0},1,0,0,{"$f":"ROUND(SUM($L90*Account!$AI$2),2)","v":0},{"$f":"ROUND(SUM($M90*Account!$AH$2),2)","v":0},{"$f":"IF(Account!$Z$2=0,0,SUM(Account!$Z$2-$D90))","v":0},1,{"$f":"SUM(SUM(SUM(SUM($N90:$O90)/$I90*$P90)*Account!$Y$2)/100)","v":0},{"$f":"SUM(SUM(SUM(SUM($N90:$O90)/$I90*$Q90)*Account!$X$2)/100)","v":0},{"$f":"IF(Account!$AC$2=0,0,SUM(Account!$AC$2-$D90))","v":0},1,0,0,{"$f":"SUM($V90*Account!$AB$2)","v":0},{"$f":"SUM($W90*Account!$AA$2)","v":0},0]
[90,null,null,null,null,null,null,null,1,{"$f":"IF(Account!$AJ$2=0,0,SUM(Account!$AJ$2-$D91))","v":0},1,0,0,{"$f":"ROUND(SUM($L91*Account!$AI$2),2)","v":0},{"$f":"ROUND(SUM($M91*Account!$AH$2),2)","v":0},{"$f":"IF(Account!$Z$2=0,0,SUM(Account!$Z$2-$D91))","v":0},1,{"$f":"SUM(SUM(SUM(SUM($N91:$O91)/$I91*$P91)*Account!$Y$2)/100)","v":0},{"$f":"SUM(SUM(SUM(SUM($N91:$O91)/$I91*$Q91)*Account!$X$2)/100)","v":0},{"$f":"IF(Account!$AC$2=0,0,SUM(Account!$AC$2-$D91))","v":0},1,0,0,{"$f":"SUM($V91*Account!$AB$2)","v":0},{"$f":"SUM($W91*Account!$AA$2)","v":0},0]
[91,null,null,null,null,null,null,null,1,{"$f":"IF(Account!$AJ$2=0,0,SUM(Account!$AJ$2-$D92))","v":0},1,0,0,{"$f":"ROUND(SUM($L92*Account!$AI$2),2)","v":0},{"$f":"ROUND(SUM($M92*Account!$AH$2),2)","v":0},{"$f":"IF(Account!$Z$2=0,0,SUM(Account!$Z$2-$D92))","v":0},1,{"$f":"SUM(SUM(SUM(SUM($N92:$O92)/$I92*$P92)*Account!$Y$2)/100)","v":0},{"$f":"SUM(SUM(SUM(SUM($N92:$O92)/$I92*$Q92)*Account!$X$2)/100)","v":0},{"$f":"IF(Account!$AC$2=0,0,SUM(Account!$AC$2-$D92))","v":0},1,0,0,{"$f":"SUM($V92*Account!$AB$2)","v":0},{"$f":"SUM($W92*Account!$AA$2)","v":0},0]
[92,null,null,null,null,null,null,null,1,{"$f":"IF(Account!$AJ$2=0,0,SUM(Account!$AJ$2-$D93))","v":0},1,0,0,{"$f":"ROUND(SUM($L93*Account!$AI$2),2)","v":0},{"$f":"ROUND(SUM($M93*Account!$AH$2),2)","v":0},{"$f":"IF(Account!$Z$2=0,0,SUM(Account!$Z$2-$D93))","v":0},1,{"$f":"SUM(SUM(SUM(SUM($N93:$O93)/$I93*$P93)*Account!$Y$2)/100)","v":0},{"$f":"SUM(SUM(SUM(SUM($N93:$O93)/$I93*$Q93)*Account!$X$2)/100)","v":0},{"$f":"IF(Account!$AC$2=0,0,SUM(Account!$AC$2-$D93))","v":0},1,0,0,{"$f":"SUM($V93*Account!$AB$2)","v":0},{"$f":"SUM($W93*Account!$AA$2)","v":0},0]
[93,null,null,null,null,null,null,null,1,{"$f":"IF(Account!$AJ$2=0,0,SUM(Account!$AJ$2-$D94))","v":0},1,0,0,{"$f":"ROUND(SUM($L94*Account!$AI$2),2)","v":0},{"$f":"ROUND(SUM($M94*Account!$AH$2),2)","v":0},{"$f":"IF(Account!$Z$2=0,0,SUM(Account!$Z$2-$D94))","v":0},1,{"$f":"SUM(SUM(SUM(SUM($N94:$O94)/$I94*$P94)*Account!$Y$2)/100)","v":0},{"$f":"SUM(SUM(SUM(SUM($N94:$O94)/$I94*$Q94)*Account!$X$2)/100)","v":0},{"$f":"IF(Account!$AC$2=0,0,SUM(Account!$AC$2-$D94))","v":0},1,0,0,{"$f":"SUM($V94*Account!$AB$2)","v":0},{"$f":"SUM($W94*Account!$AA$2)","v":0},0]
[94,null,null,null,null,null,null,null,1,{"$f":"IF(Account!$AJ$2=0,0,SUM(Account!$AJ$2-$D95))","v":0},1,0,0,{"$f":"ROUND(SUM($L95*Account!$AI$2),2)","v":0},{"$f":"ROUND(SUM($M95*Account!$AH$2),2)","v":0},{"$f":"IF(Account!$Z$2=0,0,SUM(Account!$Z$2-$D95))","v":0},1,{"$f":"SUM(SUM(SUM(SUM($N95:$O95)/$I95*$P95)*Account!$Y$2)/100)","v":0},{"$f":"SUM(SUM(SUM(SUM($N95:$O95)/$I95*$Q95)*Account!$X$2)/100)","v":0},{"$f":"IF(Account!$AC$2=0,0,SUM(Account!$AC$2-$D95))","v":0},1,0,0,{"$f":"SUM($V95*Account!$AB$2)","v":0},{"$f":"SUM($W95*Account!$AA$2)","v":0},0]
[95,null,null,null,null,null,null,null,1,{"$f":"IF(Account!$AJ$2=0,0,SUM(Account!$AJ$2-$D96))","v":0},1,0,0,{"$f":"ROUND(SUM($L96*Account!$AI$2),2)","v":0},{"$f":"ROUND(SUM($M96*Account!$AH$2),2)","v":0},{"$f":"IF(Account!$Z$2=0,0,SUM(Account!$Z$2-$D96))","v":0},1,{"$f":"SUM(SUM(SUM(SUM($N96:$O96)/$I96*$P96)*Account!$Y$2)/100)","v":0},{"$f":"SUM(SUM(SUM(SUM($N96:$O96)/$I96*$Q96)*Account!$X$2)/100)","v":0},{"$f":"IF(Account!$AC$2=0,0,SUM(Account!$AC$2-$D96))","v":0},1,0,0,{"$f":"SUM($V96*Account!$AB$2)","v":0},{"$f":"SUM($W96*Account!$AA$2)","v":0},0]
[96,null,null,null,null,null,null,null,1,{"$f":"IF(Account!$AJ$2=0,0,SUM(Account!$AJ$2-$D97))","v":0},1,0,0,{"$f":"ROUND(SUM($L97*Account!$AI$2),2)","v":0},{"$f":"ROUND(SUM($M97*Account!$AH$2),2)","v":0},{"$f":"IF(Account!$Z$2=0,0,SUM(Account!$Z$2-$D97))","v":0},1,{"$f":"SUM(SUM(SUM(SUM($N97:$O97)/$I97*$P97)*Account!$Y$2)/100)","v":0},{"$f":"SUM(SUM(SUM(SUM($N97:$O97)/$I97*$Q97)*Account!$X$2)/100)","v":0},{"$f":"IF(Account!$AC$2=0,0,SUM(Account!$AC$2-$D97))","v":0},1,0,0,{"$f":"SUM($V97*Account!$AB$2)","v":0},{"$f":"SUM($W97*Account!$AA$2)","v":0},0]
[97,null,null,null,null,null,null,null,1,{"$f":"IF(Account!$AJ$2=0,0,SUM(Account!$AJ$2-$D98))","v":0},1,0,0,{"$f":"ROUND(SUM($L98*Account!$AI$2),2)","v":0},{"$f":"ROUND(SUM($M98*Account!$AH$2),2)","v":0},{"$f":"IF(Account!$Z$2=0,0,SUM(Account!$Z$2-$D98))","v":0},1,{"$f":"SUM(SUM(SUM(SUM($N98:$O98)/$I98*$P98)*Account!$Y$2)/100)","v":0},{"$f":"SUM(SUM(SUM(SUM($N98:$O98)/$I98*$Q98)*Account!$X$2)/100)","v":0},{"$f":"IF(Account!$AC$2=0,0,SUM(Account!$AC$2-$D98))","v":0},1,0,0,{"$f":"SUM($V98*Account!$AB$2)","v":0},{"$f":"SUM($W98*Account!$AA$2)","v":0},0]
[98,null,null,null,null,null,null,null,1,{"$f":"IF(Account!$AJ$2=0,0,SUM(Account!$AJ$2-$D99))","v":0},1,0,0,{"$f":"ROUND(SUM($L99*Account!$AI$2),2)","v":0},{"$f":"ROUND(SUM($M99*Account!$AH$2),2)","v":0},{"$f":"IF(Account!$Z$2=0,0,SUM(Account!$Z$2-$D99))","v":0},1,{"$f":"SUM(SUM(SUM(SUM($N99:$O99)/$I99*$P99)*Account!$Y$2)/100)","v":0},{"$f":"SUM(SUM(SUM(SUM($N99:$O99)/$I99*$Q99)*Account!$X$2)/100)","v":0},{"$f":"IF(Account!$AC$2=0,0,SUM(Account!$AC$2-$D99))","v":0},1,0,0,{"$f":"SUM($V99*Account!$AB$2)","v":0},{"$f":"SUM($W99*Account!$AA$2)","v":0},0]
[99,null,null,null,null,null,null,null,1,{"$f":"IF(Account!$AJ$2=0,0,SUM(Account!$AJ$2-$D100))","v":0},1,0,0,{"$f":"ROUND(SUM($L100*Account!$AI$2),2)","v":0},{"$f":"ROUND(SUM($M100*Account!$AH$2),2)","v":0},{"$f":"IF(Account!$Z$2=0,0,SUM(Account!$Z$2-$D100))","v":0},1,{"$f":"SUM(SUM(SUM(SUM($N100:$O100)/$I100*$P100)*Account!$Y$2)/100)","v":0},{"$f":"SUM(SUM(SUM(SUM($N100:$O100)/$I100*$Q100)*Account!$X$2)/100)","v":0},{"$f":"IF(Account!$AC$2=0,0,SUM(Account!$AC$2-$D100))","v":0},1,0,0,{"$f":"SUM($V100*Account!$AB$2)","v":0},{"$f":"SUM($W100*Account!$AA$2)","v":0},0]
[100,null,null,null,null,null,null,null,1,{"$f":"IF(Account!$AJ$2=0,0,SUM(Account!$AJ$2-$D101))","v":0},1,0,0,{"$f":"ROUND(SUM($L101*Account!$AI$2),2)","v":0},{"$f":"ROUND(SUM($M101*Account!$AH$2),2)","v":0},{"$f":"IF(Account!$Z$2=0,0,SUM(Account!$Z$2-$D101))","v":0},1,{"$f":"SUM(SUM(SUM(SUM($N101:$O101)/$I101*$P101)*Account!$Y$2)/100)","v":0},{"$f":"SUM(SUM(SUM(SUM($N101:$O101)/$I101*$Q101)*Account!$X$2)/100)","v":0},{"$f":"IF(Account!$AC$2=0,0,SUM(Account!$AC$2-$D101))","v":0},1,0,0,{"$f":"SUM($V101*Account!$AB$2)","v":0},{"$f":"SUM($W101*Account!$AA$2)","v":0},0]
[101,null,null,null,null,null,null,null,1,{"$f":"IF(Account!$AJ$2=0,0,SUM(Account!$AJ$2-$D102))","v":0},1,0,0,{"$f":"ROUND(SUM($L102*Account!$AI$2),2)","v":0},{"$f":"ROUND(SUM($M102*Account!$AH$2),2)","v":0},{"$f":"IF(Account!$Z$2=0,0,SUM(Account!$Z$2-$D102))","v":0},1,{"$f":"SUM(SUM(SUM(SUM($N102:$O102)/$I102*$P102)*Account!$Y$2)/100)","v":0},{"$f":"SUM(SUM(SUM(SUM($N102:$O102)/$I102*$Q102)*Account!$X$2)/100)","v":0},{"$f":"IF(Account!$AC$2=0,0,SUM(Account!$AC$2-$D102))","v":0},1,0,0,{"$f":"SUM($V102*Account!$AB$2)","v":0},{"$f":"SUM($W102*Account!$AA$2)","v":0},0]
[102,null,null,null,null,null,null,null,1,{"$f":"IF(Account!$AJ$2=0,0,SUM(Account!$AJ$2-$D103))","v":0},1,0,0,{"$f":"ROUND(SUM($L103*Account!$AI$2),2)","v":0},{"$f":"ROUND(SUM($M103*Account!$AH$2),2)","v":0},{"$f":"IF(Account!$Z$2=0,0,SUM(Account!$Z$2-$D103))","v":0},1,{"$f":"SUM(SUM(SUM(SUM($N103:$O103)/$I103*$P103)*Account!$Y$2)/100)","v":0},{"$f":"SUM(SUM(SUM(SUM($N103:$O103)/$I103*$Q103)*Account!$X$2)/100)","v":0},{"$f":"IF(Account!$AC$2=0,0,SUM(Account!$AC$2-$D103))","v":0},1,0,0,{"$f":"SUM($V103*Account!$AB$2)","v":0},{"$f":"SUM($W103*Account!$AA$2)","v":0},0]
[103,null,null,null,null,null,null,null,1,{"$f":"IF(Account!$AJ$2=0,0,SUM(Account!$AJ$2-$D104))","v":0},1,0,0,{"$f":"ROUND(SUM($L104*Account!$AI$2),2)","v":0},{"$f":"ROUND(SUM($M104*Account!$AH$2),2)","v":0},{"$f":"IF(Account!$Z$2=0,0,SUM(Account!$Z$2-$D104))","v":0},1,{"$f":"SUM(SUM(SUM(SUM($N104:$O104)/$I104*$P104)*Account!$Y$2)/100)","v":0},{"$f":"SUM(SUM(SUM(SUM($N104:$O104)/$I104*$Q104)*Account!$X$2)/100)","v":0},{"$f":"IF(Account!$AC$2=0,0,SUM(Account!$AC$2-$D104))","v":0},1,0,0,{"$f":"SUM($V104*Account!$AB$2)","v":0},{"$f":"SUM($W104*Account!$AA$2)","v":0},0]
[104,null,null,null,null,null,null,null,1,{"$f":"IF(Account!$AJ$2=0,0,SUM(Account!$AJ$2-$D105))","v":0},1,0,0,{"$f":"ROUND(SUM($L105*Account!$AI$2),2)","v":0},{"$f":"ROUND(SUM($M105*Account!$AH$2),2)","v":0},{"$f":"IF(Account!$Z$2=0,0,SUM(Account!$Z$2-$D105))","v":0},1,{"$f":"SUM(SUM(SUM(SUM($N105:$O105)/$I105*$P105)*Account!$Y$2)/100)","v":0},{"$f":"SUM(SUM(SUM(SUM($N105:$O105)/$I105*$Q105)*Account!$X$2)/100)","v":0},{"$f":"IF(Account!$AC$2=0,0,SUM(Account!$AC$2-$D105))","v":0},1,0,0,{"$f":"SUM($V105*Account!$AB$2)","v":0},{"$f":"SUM($W105*Account!$AA$2)","v":0},0]
[105,null,null,null,null,null,null,null,1,{"$f":"IF(Account!$AJ$2=0,0,SUM(Account!$AJ$2-$D106))","v":0},1,0,0,{"$f":"ROUND(SUM($L106*Account!$AI$2),2)","v":0},{"$f":"ROUND(SUM($M106*Account!$AH$2),2)","v":0},{"$f":"IF(Account!$Z$2=0,0,SUM(Account!$Z$2-$D106))","v":0},1,{"$f":"SUM(SUM(SUM(SUM($N106:$O106)/$I106*$P106)*Account!$Y$2)/100)","v":0},{"$f":"SUM(SUM(SUM(SUM($N106:$O106)/$I106*$Q106)*Account!$X$2)/100)","v":0},{"$f":"IF(Account!$AC$2=0,0,SUM(Account!$AC$2-$D106))","v":0},1,0,0,{"$f":"SUM($V106*Account!$AB$2)","v":0},{"$f":"SUM($W106*Account!$AA$2)","v":0},0]
[106,null,null,null,null,null,null,null,1,{"$f":"IF(Account!$AJ$2=0,0,SUM(Account!$AJ$2-$D107))","v":0},1,0,0,{"$f":"ROUND(SUM($L107*Account!$AI$2),2)","v":0},{"$f":"ROUND(SUM($M107*Account!$AH$2),2)","v":0},{"$f":"IF(Account!$Z$2=0,0,SUM(Account!$Z$2-$D107))","v":0},1,{"$f":"SUM(SUM(SUM(SUM($N107:$O107)/$I107*$P107)*Account!$Y$2)/100)","v":0},{"$f":"SUM(SUM(SUM(SUM($N107:$O107)/$I107*$Q107)*Account!$X$2)/100)","v":0},{"$f":"IF(Account!$AC$2=0,0,SUM(Account!$AC$2-$D107))","v":0},1,0,0,{"$f":"SUM($V107*Account!$AB$2)","v":0},{"$f":"SUM($W107*Account!$AA$2)","v":0},0]
[107,null,null,null,null,null,null,null,1,{"$f":"IF(Account!$AJ$2=0,0,SUM(Account!$AJ$2-$D108))","v":0},1,0,0,{"$f":"ROUND(SUM($L108*Account!$AI$2),2)","v":0},{"$f":"ROUND(SUM($M108*Account!$AH$2),2)","v":0},{"$f":"IF(Account!$Z$2=0,0,SUM(Account!$Z$2-$D108))","v":0},1,{"$f":"SUM(SUM(SUM(SUM($N108:$O108)/$I108*$P108)*Account!$Y$2)/100)","v":0},{"$f":"SUM(SUM(SUM(SUM($N108:$O108)/$I108*$Q108)*Account!$X$2)/100)","v":0},{"$f":"IF(Account!$AC$2=0,0,SUM(Account!$AC$2-$D108))","v":0},1,0,0,{"$f":"SUM($V108*Account!$AB$2)","v":0},{"$f":"SUM($W108*Account!$AA$2)","v":0},0]
[108,null,null,null,null,null,null,null,1,{"$f":"IF(Account!$AJ$2=0,0,SUM(Account!$AJ$2-$D109))","v":0},1,0,0,{"$f":"ROUND(SUM($L109*Account!$AI$2),2)","v":0},{"$f":"ROUND(SUM($M109*Account!$AH$2),2)","v":0},{"$f":"IF(Account!$Z$2=0,0,SUM(Account!$Z$2-$D109))","v":0},1,{"$f":"SUM(SUM(SUM(SUM($N109:$O109)/$I109*$P109)*Account!$Y$2)/100)","v":0},{"$f":"SUM(SUM(SUM(SUM($N109:$O109)/$I109*$Q109)*Account!$X$2)/100)","v":0},{"$f":"IF(Account!$AC$2=0,0,SUM(Account!$AC$2-$D109))","v":0},1,0,0,{"$f":"SUM($V109*Account!$AB$2)","v":0},{"$f":"SUM($W109*Account!$AA$2)","v":0},0]
[109,null,null,null,null,null,null,null,1,{"$f":"IF(Account!$AJ$2=0,0,SUM(Account!$AJ$2-$D110))","v":0},1,0,0,{"$f":"ROUND(SUM($L110*Account!$AI$2),2)","v":0},{"$f":"ROUND(SUM($M110*Account!$AH$2),2)","v":0},{"$f":"IF(Account!$Z$2=0,0,SUM(Account!$Z$2-$D110))","v":0},1,{"$f":"SUM(SUM(SUM(SUM($N110:$O110)/$I110*$P110)*Account!$Y$2)/100)","v":0},{"$f":"SUM(SUM(SUM(SUM($N110:$O110)/$I110*$Q110)*Account!$X$2)/100)","v":0},{"$f":"IF(Account!$AC$2=0,0,SUM(Account!$AC$2-$D110))","v":0},1,0,0,{"$f":"SUM($V110*Account!$AB$2)","v":0},{"$f":"SUM($W110*Account!$AA$2)","v":0},0]
[110,null,null,null,null,null,null,null,1,{"$f":"IF(Account!$AJ$2=0,0,SUM(Account!$AJ$2-$D111))","v":0},1,0,0,{"$f":"ROUND(SUM($L111*Account!$AI$2),2)","v":0},{"$f":"ROUND(SUM($M111*Account!$AH$2),2)","v":0},{"$f":"IF(Account!$Z$2=0,0,SUM(Account!$Z$2-$D111))","v":0},1,{"$f":"SUM(SUM(SUM(SUM($N111:$O111)/$I111*$P111)*Account!$Y$2)/100)","v":0},{"$f":"SUM(SUM(SUM(SUM($N111:$O111)/$I111*$Q111)*Account!$X$2)/100)","v":0},{"$f":"IF(Account!$AC$2=0,0,SUM(Account!$AC$2-$D111))","v":0},1,0,0,{"$f":"SUM($V111*Account!$AB$2)","v":0},{"$f":"SUM($W111*Account!$AA$2)","v":0},0]
[111,null,null,null,null,null,null,null,1,{"$f":"IF(Account!$AJ$2=0,0,SUM(Account!$AJ$2-$D112))","v":0},1,0,0,{"$f":"ROUND(SUM($L112*Account!$AI$2),2)","v":0},{"$f":"ROUND(SUM($M112*Account!$AH$2),2)","v":0},{"$f":"IF(Account!$Z$2=0,0,SUM(Account!$Z$2-$D112))","v":0},1,{"$f":"SUM(SUM(SUM(SUM($N112:$O112)/$I112*$P112)*Account!$Y$2)/100)","v":0},{"$f":"SUM(SUM(SUM(SUM($N112:$O112)/$I112*$Q112)*Account!$X$2)/100)","v":0},{"$f":"IF(Account!$AC$2=0,0,SUM(Account!$AC$2-$D112))","v":0},1,0,0,{"$f":"SUM($V112*Account!$AB$2)","v":0},{"$f":"SUM($W112*Account!$AA$2)","v":0},0]
[112,null,null,null,null,null,null,null,1,{"$f":"IF(Account!$AJ$2=0,0,SUM(Account!$AJ$2-$D113))","v":0},1,0,0,{"$f":"ROUND(SUM($L113*Account!$AI$2),2)","v":0},{"$f":"ROUND(SUM($M113*Account!$AH$2),2)","v":0},{"$f":"IF(Account!$Z$2=0,0,SUM(Account!$Z$2-$D113))","v":0},1,{"$f":"SUM(SUM(SUM(SUM($N113:$O113)/$I113*$P113)*Account!$Y$2)/100)","v":0},{"$f":"SUM(SUM(SUM(SUM($N113:$O113)/$I113*$Q113)*Account!$X$2)/100)","v":0},{"$f":"IF(Account!$AC$2=0,0,SUM(Account!$AC$2-$D113))","v":0},1,0,0,{"$f":"SUM($V113*Account!$AB$2)","v":0},{"$f":"SUM($W113*Account!$AA$2)","v":0},0]
[113,null,null,null,null,null,null,null,1,{"$f":"IF(Account!$AJ$2=0,0,SUM(Account!$AJ$2-$D114))","v":0},1,0,0,{"$f":"ROUND(SUM($L114*Account!$AI$2),2)","v":0},{"$f":"ROUND(SUM($M114*Account!$AH$2),2)","v":0},{"$f":"IF(Account!$Z$2=0,0,SUM(Account!$Z$2-$D114))","v":0},1,{"$f":"SUM(SUM(SUM(SUM($N114:$O114)/$I114*$P114)*Account!$Y$2)/100)","v":0},{"$f":"SUM(SUM(SUM(SUM($N114:$O114)/$I114*$Q114)*Account!$X$2)/100)","v":0},{"$f":"IF(Account!$AC$2=0,0,SUM(Account!$AC$2-$D114))","v":0},1,0,0,{"$f":"SUM($V114*Account!$AB$2)","v":0},{"$f":"SUM($W114*Account!$AA$2)","v":0},0]
[114,null,null,null,null,null,null,null,1,{"$f":"IF(Account!$AJ$2=0,0,SUM(Account!$AJ$2-$D115))","v":0},1,0,0,{"$f":"ROUND(SUM($L115*Account!$AI$2),2)","v":0},{"$f":"ROUND(SUM($M115*Account!$AH$2),2)","v":0},{"$f":"IF(Account!$Z$2=0,0,SUM(Account!$Z$2-$D115))","v":0},1,{"$f":"SUM(SUM(SUM(SUM($N115:$O115)/$I115*$P115)*Account!$Y$2)/100)","v":0},{"$f":"SUM(SUM(SUM(SUM($N115:$O115)/$I115*$Q115)*Account!$X$2)/100)","v":0},{"$f":"IF(Account!$AC$2=0,0,SUM(Account!$AC$2-$D115))","v":0},1,0,0,{"$f":"SUM($V115*Account!$AB$2)","v":0},{"$f":"SUM($W115*Account!$AA$2)","v":0},0]
[115,null,null,null,null,null,null,null,1,{"$f":"IF(Account!$AJ$2=0,0,SUM(Account!$AJ$2-$D116))","v":0},1,0,0,{"$f":"ROUND(SUM($L116*Account!$AI$2),2)","v":0},{"$f":"ROUND(SUM($M116*Account!$AH$2),2)","v":0},{"$f":"IF(Account!$Z$2=0,0,SUM(Account!$Z$2-$D116))","v":0},1,{"$f":"SUM(SUM(SUM(SUM($N116:$O116)/$I116*$P116)*Account!$Y$2)/100)","v":0},{"$f":"SUM(SUM(SUM(SUM($N116:$O116)/$I116*$Q116)*Account!$X$2)/100)","v":0},{"$f":"IF(Account!$AC$2=0,0,SUM(Account!$AC$2-$D116))","v":0},1,0,0,{"$f":"SUM($V116*Account!$AB$2)","v":0},{"$f":"SUM($W116*Account!$AA$2)","v":0},0]
[116,null,null,null,null,null,null,null,1,{"$f":"IF(Account!$AJ$2=0,0,SUM(Account!$AJ$2-$D117))","v":0},1,0,0,{"$f":"ROUND(SUM($L117*Account!$AI$2),2)","v":0},{"$f":"ROUND(SUM($M117*Account!$AH$2),2)","v":0},{"$f":"IF(Account!$Z$2=0,0,SUM(Account!$Z$2-$D117))","v":0},1,{"$f":"SUM(SUM(SUM(SUM($N117:$O117)/$I117*$P117)*Account!$Y$2)/100)","v":0},{"$f":"SUM(SUM(SUM(SUM($N117:$O117)/$I117*$Q117)*Account!$X$2)/100)","v":0},{"$f":"IF(Account!$AC$2=0,0,SUM(Account!$AC$2-$D117))","v":0},1,0,0,{"$f":"SUM($V117*Account!$AB$2)","v":0},{"$f":"SUM($W117*Account!$AA$2)","v":0},0]
[117,null,null,null,null,null,null,null,1,{"$f":"IF(Account!$AJ$2=0,0,SUM(Account!$AJ$2-$D118))","v":0},1,0,0,{"$f":"ROUND(SUM($L118*Account!$AI$2),2)","v":0},{"$f":"ROUND(SUM($M118*Account!$AH$2),2)","v":0},{"$f":"IF(Account!$Z$2=0,0,SUM(Account!$Z$2-$D118))","v":0},1,{"$f":"SUM(SUM(SUM(SUM($N118:$O118)/$I118*$P118)*Account!$Y$2)/100)","v":0},{"$f":"SUM(SUM(SUM(SUM($N118:$O118)/$I118*$Q118)*Account!$X$2)/100)","v":0},{"$f":"IF(Account!$AC$2=0,0,SUM(Account!$AC$2-$D118))","v":0},1,0,0,{"$f":"SUM($V118*Account!$AB$2)","v":0},{"$f":"SUM($W118*Account!$AA$2)","v":0},0]
[118,null,null,null,null,null,null,null,1,{"$f":"IF(Account!$AJ$2=0,0,SUM(Account!$AJ$2-$D119))","v":0},1,0,0,{"$f":"ROUND(SUM($L119*Account!$AI$2),2)","v":0},{"$f":"ROUND(SUM($M119*Account!$AH$2),2)","v":0},{"$f":"IF(Account!$Z$2=0,0,SUM(Account!$Z$2-$D119))","v":0},1,{"$f":"SUM(SUM(SUM(SUM($N119:$O119)/$I119*$P119)*Account!$Y$2)/100)","v":0},{"$f":"SUM(SUM(SUM(SUM($N119:$O119)/$I119*$Q119)*Account!$X$2)/100)","v":0},{"$f":"IF(Account!$AC$2=0,0,SUM(Account!$AC$2-$D119))","v":0},1,0,0,{"$f":"SUM($V119*Account!$AB$2)","v":0},{"$f":"SUM($W119*Account!$AA$2)","v":0},0]
[119,null,null,null,null,null,null,null,1,{"$f":"IF(Account!$AJ$2=0,0,SUM(Account!$AJ$2-$D120))","v":0},1,0,0,{"$f":"ROUND(SUM($L120*Account!$AI$2),2)","v":0},{"$f":"ROUND(SUM($M120*Account!$AH$2),2)","v":0},{"$f":"IF(Account!$Z$2=0,0,SUM(Account!$Z$2-$D120))","v":0},1,{"$f":"SUM(SUM(SUM(SUM($N120:$O120)/$I120*$P120)*Account!$Y$2)/100)","v":0},{"$f":"SUM(SUM(SUM(SUM($N120:$O120)/$I120*$Q120)*Account!$X$2)/100)","v":0},{"$f":"IF(Account!$AC$2=0,0,SUM(Account!$AC$2-$D120))","v":0},1,0,0,{"$f":"SUM($V120*Account!$AB$2)","v":0},{"$f":"SUM($W120*Account!$AA$2)","v":0},0]
[120,null,null,null,null,null,null,null,1,{"$f":"IF(Account!$AJ$2=0,0,SUM(Account!$AJ$2-$D121))","v":0},1,0,0,{"$f":"ROUND(SUM($L121*Account!$AI$2),2)","v":0},{"$f":"ROUND(SUM($M121*Account!$AH$2),2)","v":0},{"$f":"IF(Account!$Z$2=0,0,SUM(Account!$Z$2-$D121))","v":0},1,{"$f":"SUM(SUM(SUM(SUM($N121:$O121)/$I121*$P121)*Account!$Y$2)/100)","v":0},{"$f":"SUM(SUM(SUM(SUM($N121:$O121)/$I121*$Q121)*Account!$X$2)/100)","v":0},{"$f":"IF(Account!$AC$2=0,0,SUM(Account!$AC$2-$D121))","v":0},1,0,0,{"$f":"SUM($V121*Account!$AB$2)","v":0},{"$f":"SUM($W121*Account!$AA$2)","v":0},0]
[121,null,null,null,null,null,null,null,1,{"$f":"IF(Account!$AJ$2=0,0,SUM(Account!$AJ$2-$D122))","v":0},1,0,0,{"$f":"ROUND(SUM($L122*Account!$AI$2),2)","v":0},{"$f":"ROUND(SUM($M122*Account!$AH$2),2)","v":0},{"$f":"IF(Account!$Z$2=0,0,SUM(Account!$Z$2-$D122))","v":0},1,{"$f":"SUM(SUM(SUM(SUM($N122:$O122)/$I122*$P122)*Account!$Y$2)/100)","v":0},{"$f":"SUM(SUM(SUM(SUM($N122:$O122)/$I122*$Q122)*Account!$X$2)/100)","v":0},{"$f":"IF(Account!$AC$2=0,0,SUM(Account!$AC$2-$D122))","v":0},1,0,0,{"$f":"SUM($V122*Account!$AB$2)","v":0},{"$f":"SUM($W122*Account!$AA$2)","v":0},0]
[122,null,null,null,null,null,null,null,1,{"$f":"IF(Account!$AJ$2=0,0,SUM(Account!$AJ$2-$D123))","v":0},1,0,0,{"$f":"ROUND(SUM($L123*Account!$AI$2),2)","v":0},{"$f":"ROUND(SUM($M123*Account!$AH$2),2)","v":0},{"$f":"IF(Account!$Z$2=0,0,SUM(Account!$Z$2-$D123))","v":0},1,{"$f":"SUM(SUM(SUM(SUM($N123:$O123)/$I123*$P123)*Account!$Y$2)/100)","v":0},{"$f":"SUM(SUM(SUM(SUM($N123:$O123)/$I123*$Q123)*Account!$X$2)/100)","v":0},{"$f":"IF(Account!$AC$2=0,0,SUM(Account!$AC$2-$D123))","v":0},1,0,0,{"$f":"SUM($V123*Account!$AB$2)","v":0},{"$f":"SUM($W123*Account!$AA$2)","v":0},0]
[123,null,null,null,null,null,null,null,1,{"$f":"IF(Account!$AJ$2=0,0,SUM(Account!$AJ$2-$D124))","v":0},1,0,0,{"$f":"ROUND(SUM($L124*Account!$AI$2),2)","v":0},{"$f":"ROUND(SUM($M124*Account!$AH$2),2)","v":0},{"$f":"IF(Account!$Z$2=0,0,SUM(Account!$Z$2-$D124))","v":0},1,{"$f":"SUM(SUM(SUM(SUM($N124:$O124)/$I124*$P124)*Account!$Y$2)/100)","v":0},{"$f":"SUM(SUM(SUM(SUM($N124:$O124)/$I124*$Q124)*Account!$X$2)/100)","v":0},{"$f":"IF(Account!$AC$2=0,0,SUM(Account!$AC$2-$D124))","v":0},1,0,0,{"$f":"SUM($V124*Account!$AB$2)","v":0},{"$f":"SUM($W124*Account!$AA$2)","v":0},0]
[124,null,null,null,null,null,null,null,1,{"$f":"IF(Account!$AJ$2=0,0,SUM(Account!$AJ$2-$D125))","v":0},1,0,0,{"$f":"ROUND(SUM($L125*Account!$AI$2),2)","v":0},{"$f":"ROUND(SUM($M125*Account!$AH$2),2)","v":0},{"$f":"IF(Account!$Z$2=0,0,SUM(Account!$Z$2-$D125))","v":0},1,{"$f":"SUM(SUM(SUM(SUM($N125:$O125)/$I125*$P125)*Account!$Y$2)/100)","v":0},{"$f":"SUM(SUM(SUM(SUM($N125:$O125)/$I125*$Q125)*Account!$X$2)/100)","v":0},{"$f":"IF(Account!$AC$2=0,0,SUM(Account!$AC$2-$D125))","v":0},1,0,0,{"$f":"SUM($V125*Account!$AB$2)","v":0},{"$f":"SUM($W125*Account!$AA$2)","v":0},0]
[125,null,null,null,null,null,null,null,1,{"$f":"IF(Account!$AJ$2=0,0,SUM(Account!$AJ$2-$D126))","v":0},1,0,0,{"$f":"ROUND(SUM($L126*Account!$AI$2),2)","v":0},{"$f":"ROUND(SUM($M126*Account!$AH$2),2)","v":0},{"$f":"IF(Account!$Z$2=0,0,SUM(Account!$Z$2-$D126))","v":0},1,{"$f":"SUM(SUM(SUM(SUM($N126:$O126)/$I126*$P126)*Account!$Y$2)/100)","v":0},{"$f":"SUM(SUM(SUM(SUM($N126:$O126)/$I126*$Q126)*Account!$X$2)/100)","v":0},{"$f":"IF(Account!$AC$2=0,0,SUM(Account!$AC$2-$D126))","v":0},1,0,0,{"$f":"SUM($V126*Account!$AB$2)","v":0},{"$f":"SUM($W126*Account!$AA$2)","v":0},0]
[126,null,null,null,null,null,null,null,1,{"$f":"IF(Account!$AJ$2=0,0,SUM(Account!$AJ$2-$D127))","v":0},1,0,0,{"$f":"ROUND(SUM($L127*Account!$AI$2),2)","v":0},{"$f":"ROUND(SUM($M127*Account!$AH$2),2)","v":0},{"$f":"IF(Account!$Z$2=0,0,SUM(Account!$Z$2-$D127))","v":0},1,{"$f":"SUM(SUM(SUM(SUM($N127:$O127)/$I127*$P127)*Account!$Y$2)/100)","v":0},{"$f":"SUM(SUM(SUM(SUM($N127:$O127)/$I127*$Q127)*Account!$X$2)/100)","v":0},{"$f":"IF(Account!$AC$2=0,0,SUM(Account!$AC$2-$D127))","v":0},1,0,0,{"$f":"SUM($V127*Account!$AB$2)","v":0},{"$f":"SUM($W127*Account!$AA$2)","v":0},0]
[127,null,null,null,null,null,null,null,1,{"$f":"IF(Account!$AJ$2=0,0,SUM(Account!$AJ$2-$D128))","v":0},1,0,0,{"$f":"ROUND(SUM($L128*Account!$AI$2),2)","v":0},{"$f":"ROUND(SUM($M128*Account!$AH$2),2)","v":0},{"$f":"IF(Account!$Z$2=0,0,SUM(Account!$Z$2-$D128))","v":0},1,{"$f":"SUM(SUM(SUM(SUM($N128:$O128)/$I128*$P128)*Account!$Y$2)/100)","v":0},{"$f":"SUM(SUM(SUM(SUM($N128:$O128)/$I128*$Q128)*Account!$X$2)/100)","v":0},{"$f":"IF(Account!$AC$2=0,0,SUM(Account!$AC$2-$D128))","v":0},1,0,0,{"$f":"SUM($V128*Account!$AB$2)","v":0},{"$f":"SUM($W128*Account!$AA$2)","v":0},0]
[128,null,null,null,null,null,null,null,1,{"$f":"IF(Account!$AJ$2=0,0,SUM(Account!$AJ$2-$D129))","v":0},1,0,0,{"$f":"ROUND(SUM($L129*Account!$AI$2),2)","v":0},{"$f":"ROUND(SUM($M129*Account!$AH$2),2)","v":0},{"$f":"IF(Account!$Z$2=0,0,SUM(Account!$Z$2-$D129))","v":0},1,{"$f":"SUM(SUM(SUM(SUM($N129:$O129)/$I129*$P129)*Account!$Y$2)/100)","v":0},{"$f":"SUM(SUM(SUM(SUM($N129:$O129)/$I129*$Q129)*Account!$X$2)/100)","v":0},{"$f":"IF(Account!$AC$2=0,0,SUM(Account!$AC$2-$D129))","v":0},1,0,0,{"$f":"SUM($V129*Account!$AB$2)","v":0},{"$f":"SUM($W129*Account!$AA$2)","v":0},0]
[129,null,null,null,null,null,null,null,1,{"$f":"IF(Account!$AJ$2=0,0,SUM(Account!$AJ$2-$D130))","v":0},{"$f":"SUM($I130-$J130)","v":1},0,0,{"$f":"ROUND(SUM($L130*Account!$AI$2),2)","v":0},{"$f":"ROUND(SUM($M130*Account!$AH$2),2)","v":0},{"$f":"IF(Account!$Z$2=0,0,SUM(Account!$Z$2-$D130))","v":0},{"$f":"SUM($I130-$P130)","v":1},{"$f":"SUM(SUM(SUM(SUM($N130:$O130)/$I130*$P130)*Account!$Y$2)/100)","v":0},{"$f":"SUM(SUM(SUM(SUM($N130:$O130)/$I130*$Q130)*Account!$X$2)/100)","v":0},{"$f":"IF(Account!$AC$2=0,0,SUM(Account!$AC$2-$D130))","v":0},{"$f":"SUM($I130-$T130)","v":1},0,0,{"$f":"SUM($V130*Account!$AB$2)","v":0},{"$f":"SUM($W130*Account!$AA$2)","v":0},0]
[130,null,null,null,null,null,null,null,{"$f":"SUM($E131-$D131+1)","v":1},{"$f":"IF(Account!$AJ$2=0,0,SUM(Account!$AJ$2-$D131))","v":0},1,{"$f":"ROUND(IF($J131=0,0,SUM($H131/$I131*$K131)),2)","v":0},{"$f":"ROUND(SUM($H131-$L131),2)","v":0},{"$f":"ROUND(SUM($L131*Account!$AI$2),2)","v":0},{"$f":"ROUND(SUM($M131*Account!$AH$2),2)","v":0},{"$f":"IF(Account!$Z$2=0,0,SUM(Account!$Z$2-$D131))","v":0},1,{"$f":"SUM(SUM(SUM(SUM($N131:$O131)/$I131*$P131)*Account!$Y$2)/100)","v":0},{"$f":"SUM(SUM(SUM(SUM($N131:$O131)/$I131*$Q131)*Account!$X$2)/100)","v":0},{"$f":"IF(Account!$AC$2=0,0,SUM(Account!$AC$2-$D131))","v":0},1,{"$f":"ROUND(IF($T131=0,0,SUM($H131/$I131*$T131)),2)","v":0},{"$f":"ROUND(SUM($H131-$V131),2)","v":0},{"$f":"SUM($V131*Account!$AB$2)","v":0},{"$f":"SUM($W131*Account!$AA$2)","v":0},{"$f":"SUM($N131:$O131,$R131:$S131,$X131:$Y131)","v":0}]
[131,null,null,null,null,null,null,null,1,{"$f":"IF(Account!$AJ$2=0,0,SUM(Account!$AJ$2-$D132))","v":0},1,0,0,{"$f":"ROUND(SUM($L132*Account!$AI$2),2)","v":0},{"$f":"ROUND(SUM($M132*Account!$AH$2),2)","v":0},{"$f":"IF(Account!$Z$2=0,0,SUM(Account!$Z$2-$D132))","v":0},1,{"$f":"SUM(SUM(SUM(SUM($N132:$O132)/$I132*$P132)*Account!$Y$2)/100)","v":0},{"$f":"SUM(SUM(SUM(SUM($N132:$O132)/$I132*$Q132)*Account!$X$2)/100)","v":0},{"$f":"IF(Account!$AC$2=0,0,SUM(Account!$AC$2-$D132))","v":0},1,0,0,{"$f":"SUM($V132*Account!$AB$2)","v":0},{"$f":"SUM($W132*Account!$AA$2)","v":0},0]
[132,null,null,null,null,null,null,null,1,{"$f":"IF(Account!$AJ$2=0,0,SUM(Account!$AJ$2-$D133))","v":0},1,0,0,{"$f":"ROUND(SUM($L133*Account!$AI$2),2)","v":0},{"$f":"ROUND(SUM($M133*Account!$AH$2),2)","v":0},{"$f":"IF(Account!$Z$2=0,0,SUM(Account!$Z$2-$D133))","v":0},1,{"$f":"SUM(SUM(SUM(SUM($N133:$O133)/$I133*$P133)*Account!$Y$2)/100)","v":0},{"$f":"SUM(SUM(SUM(SUM($N133:$O133)/$I133*$Q133)*Account!$X$2)/100)","v":0},{"$f":"IF(Account!$AC$2=0,0,SUM(Account!$AC$2-$D133))","v":0},1,0,0,{"$f":"SUM($V133*Account!$AB$2)","v":0},{"$f":"SUM($W133*Account!$AA$2)","v":0},0]
[133,null,null,null,null,null,null,null,1,{"$f":"IF(Account!$AJ$2=0,0,SUM(Account!$AJ$2-$D134))","v":0},1,0,0,{"$f":"ROUND(SUM($L134*Account!$AI$2),2)","v":0},{"$f":"ROUND(SUM($M134*Account!$AH$2),2)","v":0},{"$f":"IF(Account!$Z$2=0,0,SUM(Account!$Z$2-$D134))","v":0},1,{"$f":"SUM(SUM(SUM(SUM($N134:$O134)/$I134*$P134)*Account!$Y$2)/100)","v":0},{"$f":"SUM(SUM(SUM(SUM($N134:$O134)/$I134*$Q134)*Account!$X$2)/100)","v":0},{"$f":"IF(Account!$AC$2=0,0,SUM(Account!$AC$2-$D134))","v":0},1,0,0,{"$f":"SUM($V134*Account!$AB$2)","v":0},{"$f":"SUM($W134*Account!$AA$2)","v":0},0]
[134,null,null,null,null,null,null,null,1,{"$f":"IF(Account!$AJ$2=0,0,SUM(Account!$AJ$2-$D135))","v":0},1,0,0,{"$f":"ROUND(SUM($L135*Account!$AI$2),2)","v":0},{"$f":"ROUND(SUM($M135*Account!$AH$2),2)","v":0},{"$f":"IF(Account!$Z$2=0,0,SUM(Account!$Z$2-$D135))","v":0},1,{"$f":"SUM(SUM(SUM(SUM($N135:$O135)/$I135*$P135)*Account!$Y$2)/100)","v":0},{"$f":"SUM(SUM(SUM(SUM($N135:$O135)/$I135*$Q135)*Account!$X$2)/100)","v":0},{"$f":"IF(Account!$AC$2=0,0,SUM(Account!$AC$2-$D135))","v":0},1,0,0,{"$f":"SUM($V135*Account!$AB$2)","v":0},{"$f":"SUM($W135*Account!$AA$2)","v":0},0]
[135,null,null,null,null,null,null,null,1,{"$f":"IF(Account!$AJ$2=0,0,SUM(Account!$AJ$2-$D136))","v":0},1,0,0,{"$f":"ROUND(SUM($L136*Account!$AI$2),2)","v":0},{"$f":"ROUND(SUM($M136*Account!$AH$2),2)","v":0},{"$f":"IF(Account!$Z$2=0,0,SUM(Account!$Z$2-$D136))","v":0},1,{"$f":"SUM(SUM(SUM(SUM($N136:$O136)/$I136*$P136)*Account!$Y$2)/100)","v":0},{"$f":"SUM(SUM(SUM(SUM($N136:$O136)/$I136*$Q136)*Account!$X$2)/100)","v":0},{"$f":"IF(Account!$AC$2=0,0,SUM(Account!$AC$2-$D136))","v":0},1,0,0,{"$f":"SUM($V136*Account!$AB$2)","v":0},{"$f":"SUM($W136*Account!$AA$2)","v":0},0]
[136,null,null,null,null,null,null,null,1,{"$f":"IF(Account!$AJ$2=0,0,SUM(Account!$AJ$2-$D137))","v":0},1,0,0,{"$f":"ROUND(SUM($L137*Account!$AI$2),2)","v":0},{"$f":"ROUND(SUM($M137*Account!$AH$2),2)","v":0},{"$f":"IF(Account!$Z$2=0,0,SUM(Account!$Z$2-$D137))","v":0},1,{"$f":"SUM(SUM(SUM(SUM($N137:$O137)/$I137*$P137)*Account!$Y$2)/100)","v":0},{"$f":"SUM(SUM(SUM(SUM($N137:$O137)/$I137*$Q137)*Account!$X$2)/100)","v":0},{"$f":"IF(Account!$AC$2=0,0,SUM(Account!$AC$2-$D137))","v":0},1,0,0,{"$f":"SUM($V137*Account!$AB$2)","v":0},{"$f":"SUM($W137*Account!$AA$2)","v":0},0]
[137,null,null,null,null,null,null,null,1,{"$f":"IF(Account!$AJ$2=0,0,SUM(Account!$AJ$2-$D138))","v":0},1,0,0,{"$f":"ROUND(SUM($L138*Account!$AI$2),2)","v":0},{"$f":"ROUND(SUM($M138*Account!$AH$2),2)","v":0},{"$f":"IF(Account!$Z$2=0,0,SUM(Account!$Z$2-$D138))","v":0},1,{"$f":"SUM(SUM(SUM(SUM($N138:$O138)/$I138*$P138)*Account!$Y$2)/100)","v":0},{"$f":"SUM(SUM(SUM(SUM($N138:$O138)/$I138*$Q138)*Account!$X$2)/100)","v":0},{"$f":"IF(Account!$AC$2=0,0,SUM(Account!$AC$2-$D138))","v":0},1,0,0,{"$f":"SUM($V138*Account!$AB$2)","v":0},{"$f":"SUM($W138*Account!$AA$2)","v":0},0]
[138,null,null,null,null,null,null,null,1,{"$f":"IF(Account!$AJ$2=0,0,SUM(Account!$AJ$2-$D139))","v":0},1,0,0,{"$f":"ROUND(SUM($L139*Account!$AI$2),2)","v":0},{"$f":"ROUND(SUM($M139*Account!$AH$2),2)","v":0},{"$f":"IF(Account!$Z$2=0,0,SUM(Account!$Z$2-$D139))","v":0},1,{"$f":"SUM(SUM(SUM(SUM($N139:$O139)/$I139*$P139)*Account!$Y$2)/100)","v":0},{"$f":"SUM(SUM(SUM(SUM($N139:$O139)/$I139*$Q139)*Account!$X$2)/100)","v":0},{"$f":"IF(Account!$AC$2=0,0,SUM(Account!$AC$2-$D139))","v":0},1,0,0,{"$f":"SUM($V139*Account!$AB$2)","v":0},{"$f":"SUM($W139*Account!$AA$2)","v":0},0]
[139,null,null,null,null,null,null,null,1,{"$f":"IF(Account!$AJ$2=0,0,SUM(Account!$AJ$2-$D140))","v":0},1,0,0,{"$f":"ROUND(SUM($L140*Account!$AI$2),2)","v":0},{"$f":"ROUND(SUM($M140*Account!$AH$2),2)","v":0},{"$f":"IF(Account!$Z$2=0,0,SUM(Account!$Z$2-$D140))","v":0},1,{"$f":"SUM(SUM(SUM(SUM($N140:$O140)/$I140*$P140)*Account!$Y$2)/100)","v":0},{"$f":"SUM(SUM(SUM(SUM($N140:$O140)/$I140*$Q140)*Account!$X$2)/100)","v":0},{"$f":"IF(Account!$AC$2=0,0,SUM(Account!$AC$2-$D140))","v":0},1,0,0,{"$f":"SUM($V140*Account!$AB$2)","v":0},{"$f":"SUM($W140*Account!$AA$2)","v":0},0]
[140,null,null,null,null,null,null,null,1,{"$f":"IF(Account!$AJ$2=0,0,SUM(Account!$AJ$2-$D141))","v":0},1,0,0,{"$f":"ROUND(SUM($L141*Account!$AI$2),2)","v":0},{"$f":"ROUND(SUM($M141*Account!$AH$2),2)","v":0},{"$f":"IF(Account!$Z$2=0,0,SUM(Account!$Z$2-$D141))","v":0},1,{"$f":"SUM(SUM(SUM(SUM($N141:$O141)/$I141*$P141)*Account!$Y$2)/100)","v":0},{"$f":"SUM(SUM(SUM(SUM($N141:$O141)/$I141*$Q141)*Account!$X$2)/100)","v":0},{"$f":"IF(Account!$AC$2=0,0,SUM(Account!$AC$2-$D141))","v":0},1,0,0,{"$f":"SUM($V141*Account!$AB$2)","v":0},{"$f":"SUM($W141*Account!$AA$2)","v":0},0]
[141,null,null,null,null,null,null,null,1,{"$f":"IF(Account!$AJ$2=0,0,SUM(Account!$AJ$2-$D142))","v":0},1,0,0,{"$f":"ROUND(SUM($L142*Account!$AI$2),2)","v":0},{"$f":"ROUND(SUM($M142*Account!$AH$2),2)","v":0},{"$f":"IF(Account!$Z$2=0,0,SUM(Account!$Z$2-$D142))","v":0},1,{"$f":"SUM(SUM(SUM(SUM($N142:$O142)/$I142*$P142)*Account!$Y$2)/100)","v":0},{"$f":"SUM(SUM(SUM(SUM($N142:$O142)/$I142*$Q142)*Account!$X$2)/100)","v":0},{"$f":"IF(Account!$AC$2=0,0,SUM(Account!$AC$2-$D142))","v":0},1,0,0,{"$f":"SUM($V142*Account!$AB$2)","v":0},{"$f":"SUM($W142*Account!$AA$2)","v":0},0]
[142,null,null,null,null,null,null,null,1,{"$f":"IF(Account!$AJ$2=0,0,SUM(Account!$AJ$2-$D143))","v":0},1,0,0,{"$f":"ROUND(SUM($L143*Account!$AI$2),2)","v":0},{"$f":"ROUND(SUM($M143*Account!$AH$2),2)","v":0},{"$f":"IF(Account!$Z$2=0,0,SUM(Account!$Z$2-$D143))","v":0},1,{"$f":"SUM(SUM(SUM(SUM($N143:$O143)/$I143*$P143)*Account!$Y$2)/100)","v":0},{"$f":"SUM(SUM(SUM(SUM($N143:$O143)/$I143*$Q143)*Account!$X$2)/100)","v":0},{"$f":"IF(Account!$AC$2=0,0,SUM(Account!$AC$2-$D143))","v":0},1,0,0,{"$f":"SUM($V143*Account!$AB$2)","v":0},{"$f":"SUM($W143*Account!$AA$2)","v":0},0]
[143,null,null,null,null,null,null,null,1,{"$f":"IF(Account!$AJ$2=0,0,SUM(Account!$AJ$2-$D144))","v":0},1,0,0,{"$f":"ROUND(SUM($L144*Account!$AI$2),2)","v":0},{"$f":"ROUND(SUM($M144*Account!$AH$2),2)","v":0},{"$f":"IF(Account!$Z$2=0,0,SUM(Account!$Z$2-$D144))","v":0},1,{"$f":"SUM(SUM(SUM(SUM($N144:$O144)/$I144*$P144)*Account!$Y$2)/100)","v":0},{"$f":"SUM(SUM(SUM(SUM($N144:$O144)/$I144*$Q144)*Account!$X$2)/100)","v":0},{"$f":"IF(Account!$AC$2=0,0,SUM(Account!$AC$2-$D144))","v":0},1,0,0,{"$f":"SUM($V144*Account!$AB$2)","v":0},{"$f":"SUM($W144*Account!$AA$2)","v":0},0]
[144,null,null,null,null,null,null,null,1,{"$f":"IF(Account!$AJ$2=0,0,SUM(Account!$AJ$2-$D145))","v":0},1,0,0,{"$f":"ROUND(SUM($L145*Account!$AI$2),2)","v":0},{"$f":"ROUND(SUM($M145*Account!$AH$2),2)","v":0},{"$f":"IF(Account!$Z$2=0,0,SUM(Account!$Z$2-$D145))","v":0},1,{"$f":"SUM(SUM(SUM(SUM($N145:$O145)/$I145*$P145)*Account!$Y$2)/100)","v":0},{"$f":"SUM(SUM(SUM(SUM($N145:$O145)/$I145*$Q145)*Account!$X$2)/100)","v":0},{"$f":"IF(Account!$AC$2=0,0,SUM(Account!$AC$2-$D145))","v":0},1,0,0,{"$f":"SUM($V145*Account!$AB$2)","v":0},{"$f":"SUM($W145*Account!$AA$2)","v":0},0]
[145,null,null,null,null,null,null,null,1,{"$f":"IF(Account!$AJ$2=0,0,SUM(Account!$AJ$2-$D146))","v":0},1,0,0,{"$f":"ROUND(SUM($L146*Account!$AI$2),2)","v":0},{"$f":"ROUND(SUM($M146*Account!$AH$2),2)","v":0},{"$f":"IF(Account!$Z$2=0,0,SUM(Account!$Z$2-$D146))","v":0},1,{"$f":"SUM(SUM(SUM(SUM($N146:$O146)/$I146*$P146)*Account!$Y$2)/100)","v":0},{"$f":"SUM(SUM(SUM(SUM($N146:$O146)/$I146*$Q146)*Account!$X$2)/100)","v":0},{"$f":"IF(Account!$AC$2=0,0,SUM(Account!$AC$2-$D146))","v":0},1,0,0,{"$f":"SUM($V146*Account!$AB$2)","v":0},{"$f":"SUM($W146*Account!$AA$2)","v":0},0]
[146,null,null,null,null,null,null,null,1,{"$f":"IF(Account!$AJ$2=0,0,SUM(Account!$AJ$2-$D147))","v":0},1,0,0,{"$f":"ROUND(SUM($L147*Account!$AI$2),2)","v":0},{"$f":"ROUND(SUM($M147*Account!$AH$2),2)","v":0},{"$f":"IF(Account!$Z$2=0,0,SUM(Account!$Z$2-$D147))","v":0},1,{"$f":"SUM(SUM(SUM(SUM($N147:$O147)/$I147*$P147)*Account!$Y$2)/100)","v":0},{"$f":"SUM(SUM(SUM(SUM($N147:$O147)/$I147*$Q147)*Account!$X$2)/100)","v":0},{"$f":"IF(Account!$AC$2=0,0,SUM(Account!$AC$2-$D147))","v":0},1,0,0,{"$f":"SUM($V147*Account!$AB$2)","v":0},{"$f":"SUM($W147*Account!$AA$2)","v":0},0]
[147,null,null,null,null,null,null,null,1,{"$f":"IF(Account!$AJ$2=0,0,SUM(Account!$AJ$2-$D148))","v":0},1,0,0,{"$f":"ROUND(SUM($L148*Account!$AI$2),2)","v":0},{"$f":"ROUND(SUM($M148*Account!$AH$2),2)","v":0},{"$f":"IF(Account!$Z$2=0,0,SUM(Account!$Z$2-$D148))","v":0},1,{"$f":"SUM(SUM(SUM(SUM($N148:$O148)/$I148*$P148)*Account!$Y$2)/100)","v":0},{"$f":"SUM(SUM(SUM(SUM($N148:$O148)/$I148*$Q148)*Account!$X$2)/100)","v":0},{"$f":"IF(Account!$AC$2=0,0,SUM(Account!$AC$2-$D148))","v":0},1,0,0,{"$f":"SUM($V148*Account!$AB$2)","v":0},{"$f":"SUM($W148*Account!$AA$2)","v":0},0]
[148,null,null,null,null,null,null,null,1,{"$f":"IF(Account!$AJ$2=0,0,SUM(Account!$AJ$2-$D149))","v":0},1,0,0,{"$f":"ROUND(SUM($L149*Account!$AI$2),2)","v":0},{"$f":"ROUND(SUM($M149*Account!$AH$2),2)","v":0},{"$f":"IF(Account!$Z$2=0,0,SUM(Account!$Z$2-$D149))","v":0},1,{"$f":"SUM(SUM(SUM(SUM($N149:$O149)/$I149*$P149)*Account!$Y$2)/100)","v":0},{"$f":"SUM(SUM(SUM(SUM($N149:$O149)/$I149*$Q149)*Account!$X$2)/100)","v":0},{"$f":"IF(Account!$AC$2=0,0,SUM(Account!$AC$2-$D149))","v":0},1,0,0,{"$f":"SUM($V149*Account!$AB$2)","v":0},{"$f":"SUM($W149*Account!$AA$2)","v":0},0]
[149,null,null,null,null,null,null,null,1,{"$f":"IF(Account!$AJ$2=0,0,SUM(Account!$AJ$2-$D150))","v":0},1,0,0,{"$f":"ROUND(SUM($L150*Account!$AI$2),2)","v":0},{"$f":"ROUND(SUM($M150*Account!$AH$2),2)","v":0},{"$f":"IF(Account!$Z$2=0,0,SUM(Account!$Z$2-$D150))","v":0},1,{"$f":"SUM(SUM(SUM(SUM($N150:$O150)/$I150*$P150)*Account!$Y$2)/100)","v":0},{"$f":"SUM(SUM(SUM(SUM($N150:$O150)/$I150*$Q150)*Account!$X$2)/100)","v":0},{"$f":"IF(Account!$AC$2=0,0,SUM(Account!$AC$2-$D150))","v":0},1,0,0,{"$f":"SUM($V150*Account!$AB$2)","v":0},{"$f":"SUM($W150*Account!$AA$2)","v":0},0]
[150,null,null,null,null,null,null,null,1,{"$f":"IF(Account!$AJ$2=0,0,SUM(Account!$AJ$2-$D151))","v":0},1,0,0,{"$f":"ROUND(SUM($L151*Account!$AI$2),2)","v":0},{"$f":"ROUND(SUM($M151*Account!$AH$2),2)","v":0},{"$f":"IF(Account!$Z$2=0,0,SUM(Account!$Z$2-$D151))","v":0},1,{"$f":"SUM(SUM(SUM(SUM($N151:$O151)/$I151*$P151)*Account!$Y$2)/100)","v":0},{"$f":"SUM(SUM(SUM(SUM($N151:$O151)/$I151*$Q151)*Account!$X$2)/100)","v":0},{"$f":"IF(Account!$AC$2=0,0,SUM(Account!$AC$2-$D151))","v":0},1,0,0,{"$f":"SUM($V151*Account!$AB$2)","v":0},{"$f":"SUM($W151*Account!$AA$2)","v":0},0]
[151,null,null,null,null,null,null,null,1,{"$f":"IF(Account!$AJ$2=0,0,SUM(Account!$AJ$2-$D152))","v":0},1,0,0,{"$f":"ROUND(SUM($L152*Account!$AI$2),2)","v":0},{"$f":"ROUND(SUM($M152*Account!$AH$2),2)","v":0},{"$f":"IF(Account!$Z$2=0,0,SUM(Account!$Z$2-$D152))","v":0},1,{"$f":"SUM(SUM(SUM(SUM($N152:$O152)/$I152*$P152)*Account!$Y$2)/100)","v":0},{"$f":"SUM(SUM(SUM(SUM($N152:$O152)/$I152*$Q152)*Account!$X$2)/100)","v":0},{"$f":"IF(Account!$AC$2=0,0,SUM(Account!$AC$2-$D152))","v":0},1,0,0,{"$f":"SUM($V152*Account!$AB$2)","v":0},{"$f":"SUM($W152*Account!$AA$2)","v":0},0]
[152,null,null,null,null,null,null,null,1,{"$f":"IF(Account!$AJ$2=0,0,SUM(Account!$AJ$2-$D153))","v":0},1,0,0,{"$f":"ROUND(SUM($L153*Account!$AI$2),2)","v":0},{"$f":"ROUND(SUM($M153*Account!$AH$2),2)","v":0},{"$f":"IF(Account!$Z$2=0,0,SUM(Account!$Z$2-$D153))","v":0},1,{"$f":"SUM(SUM(SUM(SUM($N153:$O153)/$I153*$P153)*Account!$Y$2)/100)","v":0},{"$f":"SUM(SUM(SUM(SUM($N153:$O153)/$I153*$Q153)*Account!$X$2)/100)","v":0},{"$f":"IF(Account!$AC$2=0,0,SUM(Account!$AC$2-$D153))","v":0},1,0,0,{"$f":"SUM($V153*Account!$AB$2)","v":0},{"$f":"SUM($W153*Account!$AA$2)","v":0},0]
[153,null,null,null,null,null,null,null,1,{"$f":"IF(Account!$AJ$2=0,0,SUM(Account!$AJ$2-$D154))","v":0},1,0,0,{"$f":"ROUND(SUM($L154*Account!$AI$2),2)","v":0},{"$f":"ROUND(SUM($M154*Account!$AH$2),2)","v":0},{"$f":"IF(Account!$Z$2=0,0,SUM(Account!$Z$2-$D154))","v":0},1,{"$f":"SUM(SUM(SUM(SUM($N154:$O154)/$I154*$P154)*Account!$Y$2)/100)","v":0},{"$f":"SUM(SUM(SUM(SUM($N154:$O154)/$I154*$Q154)*Account!$X$2)/100)","v":0},{"$f":"IF(Account!$AC$2=0,0,SUM(Account!$AC$2-$D154))","v":0},1,0,0,{"$f":"SUM($V154*Account!$AB$2)","v":0},{"$f":"SUM($W154*Account!$AA$2)","v":0},0]
[154,null,null,null,null,null,null,null,1,{"$f":"IF(Account!$AJ$2=0,0,SUM(Account!$AJ$2-$D155))","v":0},1,0,0,{"$f":"ROUND(SUM($L155*Account!$AI$2),2)","v":0},{"$f":"ROUND(SUM($M155*Account!$AH$2),2)","v":0},{"$f":"IF(Account!$Z$2=0,0,SUM(Account!$Z$2-$D155))","v":0},1,{"$f":"SUM(SUM(SUM(SUM($N155:$O155)/$I155*$P155)*Account!$Y$2)/100)","v":0},{"$f":"SUM(SUM(SUM(SUM($N155:$O155)/$I155*$Q155)*Account!$X$2)/100)","v":0},{"$f":"IF(Account!$AC$2=0,0,SUM(Account!$AC$2-$D155))","v":0},1,0,0,{"$f":"SUM($V155*Account!$AB$2)","v":0},{"$f":"SUM($W155*Account!$AA$2)","v":0},0]
[155,null,null,null,null,null,null,null,1,{"$f":"IF(Account!$AJ$2=0,0,SUM(Account!$AJ$2-$D156))","v":0},1,0,0,{"$f":"ROUND(SUM($L156*Account!$AI$2),2)","v":0},{"$f":"ROUND(SUM($M156*Account!$AH$2),2)","v":0},{"$f":"IF(Account!$Z$2=0,0,SUM(Account!$Z$2-$D156))","v":0},1,{"$f":"SUM(SUM(SUM(SUM($N156:$O156)/$I156*$P156)*Account!$Y$2)/100)","v":0},{"$f":"SUM(SUM(SUM(SUM($N156:$O156)/$I156*$Q156)*Account!$X$2)/100)","v":0},{"$f":"IF(Account!$AC$2=0,0,SUM(Account!$AC$2-$D156))","v":0},1,0,0,{"$f":"SUM($V156*Account!$AB$2)","v":0},{"$f":"SUM($W156*Account!$AA$2)","v":0},0]
[156,null,null,null,null,null,null,null,1,{"$f":"IF(Account!$AJ$2=0,0,SUM(Account!$AJ$2-$D157))","v":0},1,0,0,{"$f":"ROUND(SUM($L157*Account!$AI$2),2)","v":0},{"$f":"ROUND(SUM($M157*Account!$AH$2),2)","v":0},{"$f":"IF(Account!$Z$2=0,0,SUM(Account!$Z$2-$D157))","v":0},1,{"$f":"SUM(SUM(SUM(SUM($N157:$O157)/$I157*$P157)*Account!$Y$2)/100)","v":0},{"$f":"SUM(SUM(SUM(SUM($N157:$O157)/$I157*$Q157)*Account!$X$2)/100)","v":0},{"$f":"IF(Account!$AC$2=0,0,SUM(Account!$AC$2-$D157))","v":0},1,0,0,{"$f":"SUM($V157*Account!$AB$2)","v":0},{"$f":"SUM($W157*Account!$AA$2)","v":0},0]
[157,null,null,null,null,null,null,null,1,{"$f":"IF(Account!$AJ$2=0,0,SUM(Account!$AJ$2-$D158))","v":0},1,0,0,{"$f":"ROUND(SUM($L158*Account!$AI$2),2)","v":0},{"$f":"ROUND(SUM($M158*Account!$AH$2),2)","v":0},{"$f":"IF(Account!$Z$2=0,0,SUM(Account!$Z$2-$D158))","v":0},1,{"$f":"SUM(SUM(SUM(SUM($N158:$O158)/$I158*$P158)*Account!$Y$2)/100)","v":0},{"$f":"SUM(SUM(SUM(SUM($N158:$O158)/$I158*$Q158)*Account!$X$2)/100)","v":0},{"$f":"IF(Account!$AC$2=0,0,SUM(Account!$AC$2-$D158))","v":0},1,0,0,{"$f":"SUM($V158*Account!$AB$2)","v":0},{"$f":"SUM($W158*Account!$AA$2)","v":0},0]
[158,null,null,null,null,null,null,null,1,{"$f":"IF(Account!$AJ$2=0,0,SUM(Account!$AJ$2-$D159))","v":0},1,0,0,{"$f":"ROUND(SUM($L159*Account!$AI$2),2)","v":0},{"$f":"ROUND(SUM($M159*Account!$AH$2),2)","v":0},{"$f":"IF(Account!$Z$2=0,0,SUM(Account!$Z$2-$D159))","v":0},1,{"$f":"SUM(SUM(SUM(SUM($N159:$O159)/$I159*$P159)*Account!$Y$2)/100)","v":0},{"$f":"SUM(SUM(SUM(SUM($N159:$O159)/$I159*$Q159)*Account!$X$2)/100)","v":0},{"$f":"IF(Account!$AC$2=0,0,SUM(Account!$AC$2-$D159))","v":0},1,0,0,{"$f":"SUM($V159*Account!$AB$2)","v":0},{"$f":"SUM($W159*Account!$AA$2)","v":0},0]
[159,null,null,null,null,null,null,null,1,{"$f":"IF(Account!$AJ$2=0,0,SUM(Account!$AJ$2-$D160))","v":0},1,0,0,{"$f":"ROUND(SUM($L160*Account!$AI$2),2)","v":0},{"$f":"ROUND(SUM($M160*Account!$AH$2),2)","v":0},{"$f":"IF(Account!$Z$2=0,0,SUM(Account!$Z$2-$D160))","v":0},1,{"$f":"SUM(SUM(SUM(SUM($N160:$O160)/$I160*$P160)*Account!$Y$2)/100)","v":0},{"$f":"SUM(SUM(SUM(SUM($N160:$O160)/$I160*$Q160)*Account!$X$2)/100)","v":0},{"$f":"IF(Account!$AC$2=0,0,SUM(Account!$AC$2-$D160))","v":0},1,0,0,{"$f":"SUM($V160*Account!$AB$2)","v":0},{"$f":"SUM($W160*Account!$AA$2)","v":0},0]
[160,null,null,null,null,null,null,null,1,{"$f":"IF(Account!$AJ$2=0,0,SUM(Account!$AJ$2-$D161))","v":0},1,0,0,{"$f":"ROUND(SUM($L161*Account!$AI$2),2)","v":0},{"$f":"ROUND(SUM($M161*Account!$AH$2),2)","v":0},{"$f":"IF(Account!$Z$2=0,0,SUM(Account!$Z$2-$D161))","v":0},1,{"$f":"SUM(SUM(SUM(SUM($N161:$O161)/$I161*$P161)*Account!$Y$2)/100)","v":0},{"$f":"SUM(SUM(SUM(SUM($N161:$O161)/$I161*$Q161)*Account!$X$2)/100)","v":0},{"$f":"IF(Account!$AC$2=0,0,SUM(Account!$AC$2-$D161))","v":0},1,0,0,{"$f":"SUM($V161*Account!$AB$2)","v":0},{"$f":"SUM($W161*Account!$AA$2)","v":0},0]
[161,null,null,null,null,null,null,null,1,{"$f":"IF(Account!$AJ$2=0,0,SUM(Account!$AJ$2-$D162))","v":0},1,0,0,{"$f":"ROUND(SUM($L162*Account!$AI$2),2)","v":0},{"$f":"ROUND(SUM($M162*Account!$AH$2),2)","v":0},{"$f":"IF(Account!$Z$2=0,0,SUM(Account!$Z$2-$D162))","v":0},1,{"$f":"SUM(SUM(SUM(SUM($N162:$O162)/$I162*$P162)*Account!$Y$2)/100)","v":0},{"$f":"SUM(SUM(SUM(SUM($N162:$O162)/$I162*$Q162)*Account!$X$2)/100)","v":0},{"$f":"IF(Account!$AC$2=0,0,SUM(Account!$AC$2-$D162))","v":0},1,0,0,{"$f":"SUM($V162*Account!$AB$2)","v":0},{"$f":"SUM($W162*Account!$AA$2)","v":0},0]
[162,null,null,null,null,null,null,null,1,{"$f":"IF(Account!$AJ$2=0,0,SUM(Account!$AJ$2-$D163))","v":0},1,0,0,{"$f":"ROUND(SUM($L163*Account!$AI$2),2)","v":0},{"$f":"ROUND(SUM($M163*Account!$AH$2),2)","v":0},{"$f":"IF(Account!$Z$2=0,0,SUM(Account!$Z$2-$D163))","v":0},1,{"$f":"SUM(SUM(SUM(SUM($N163:$O163)/$I163*$P163)*Account!$Y$2)/100)","v":0},{"$f":"SUM(SUM(SUM(SUM($N163:$O163)/$I163*$Q163)*Account!$X$2)/100)","v":0},{"$f":"IF(Account!$AC$2=0,0,SUM(Account!$AC$2-$D163))","v":0},1,0,0,{"$f":"SUM($V163*Account!$AB$2)","v":0},{"$f":"SUM($W163*Account!$AA$2)","v":0},0]
[163,null,null,null,null,null,null,null,1,{"$f":"IF(Account!$AJ$2=0,0,SUM(Account!$AJ$2-$D164))","v":0},1,0,0,{"$f":"ROUND(SUM($L164*Account!$AI$2),2)","v":0},{"$f":"ROUND(SUM($M164*Account!$AH$2),2)","v":0},{"$f":"IF(Account!$Z$2=0,0,SUM(Account!$Z$2-$D164))","v":0},1,{"$f":"SUM(SUM(SUM(SUM($N164:$O164)/$I164*$P164)*Account!$Y$2)/100)","v":0},{"$f":"SUM(SUM(SUM(SUM($N164:$O164)/$I164*$Q164)*Account!$X$2)/100)","v":0},{"$f":"IF(Account!$AC$2=0,0,SUM(Account!$AC$2-$D164))","v":0},1,0,0,{"$f":"SUM($V164*Account!$AB$2)","v":0},{"$f":"SUM($W164*Account!$AA$2)","v":0},0]
[164,null,null,null,null,null,null,null,1,{"$f":"IF(Account!$AJ$2=0,0,SUM(Account!$AJ$2-$D165))","v":0},1,0,0,{"$f":"ROUND(SUM($L165*Account!$AI$2),2)","v":0},{"$f":"ROUND(SUM($M165*Account!$AH$2),2)","v":0},{"$f":"IF(Account!$Z$2=0,0,SUM(Account!$Z$2-$D165))","v":0},1,{"$f":"SUM(SUM(SUM(SUM($N165:$O165)/$I165*$P165)*Account!$Y$2)/100)","v":0},{"$f":"SUM(SUM(SUM(SUM($N165:$O165)/$I165*$Q165)*Account!$X$2)/100)","v":0},{"$f":"IF(Account!$AC$2=0,0,SUM(Account!$AC$2-$D165))","v":0},1,0,0,{"$f":"SUM($V165*Account!$AB$2)","v":0},{"$f":"SUM($W165*Account!$AA$2)","v":0},0]
[165,null,null,null,null,null,null,null,1,{"$f":"IF(Account!$AJ$2=0,0,SUM(Account!$AJ$2-$D166))","v":0},1,0,0,{"$f":"ROUND(SUM($L166*Account!$AI$2),2)","v":0},{"$f":"ROUND(SUM($M166*Account!$AH$2),2)","v":0},{"$f":"IF(Account!$Z$2=0,0,SUM(Account!$Z$2-$D166))","v":0},1,{"$f":"SUM(SUM(SUM(SUM($N166:$O166)/$I166*$P166)*Account!$Y$2)/100)","v":0},{"$f":"SUM(SUM(SUM(SUM($N166:$O166)/$I166*$Q166)*Account!$X$2)/100)","v":0},{"$f":"IF(Account!$AC$2=0,0,SUM(Account!$AC$2-$D166))","v":0},1,0,0,{"$f":"SUM($V166*Account!$AB$2)","v":0},{"$f":"SUM($W166*Account!$AA$2)","v":0},0]
[166,null,null,null,null,null,null,null,1,{"$f":"IF(Account!$AJ$2=0,0,SUM(Account!$AJ$2-$D167))","v":0},1,0,0,{"$f":"ROUND(SUM($L167*Account!$AI$2),2)","v":0},{"$f":"ROUND(SUM($M167*Account!$AH$2),2)","v":0},{"$f":"IF(Account!$Z$2=0,0,SUM(Account!$Z$2-$D167))","v":0},1,{"$f":"SUM(SUM(SUM(SUM($N167:$O167)/$I167*$P167)*Account!$Y$2)/100)","v":0},{"$f":"SUM(SUM(SUM(SUM($N167:$O167)/$I167*$Q167)*Account!$X$2)/100)","v":0},{"$f":"IF(Account!$AC$2=0,0,SUM(Account!$AC$2-$D167))","v":0},1,0,0,{"$f":"SUM($V167*Account!$AB$2)","v":0},{"$f":"SUM($W167*Account!$AA$2)","v":0},0]
[167,null,null,null,null,null,null,null,1,{"$f":"IF(Account!$AJ$2=0,0,SUM(Account!$AJ$2-$D168))","v":0},1,0,0,{"$f":"ROUND(SUM($L168*Account!$AI$2),2)","v":0},{"$f":"ROUND(SUM($M168*Account!$AH$2),2)","v":0},{"$f":"IF(Account!$Z$2=0,0,SUM(Account!$Z$2-$D168))","v":0},1,{"$f":"SUM(SUM(SUM(SUM($N168:$O168)/$I168*$P168)*Account!$Y$2)/100)","v":0},{"$f":"SUM(SUM(SUM(SUM($N168:$O168)/$I168*$Q168)*Account!$X$2)/100)","v":0},{"$f":"IF(Account!$AC$2=0,0,SUM(Account!$AC$2-$D168))","v":0},1,0,0,{"$f":"SUM($V168*Account!$AB$2)","v":0},{"$f":"SUM($W168*Account!$AA$2)","v":0},0]
[168,null,null,null,null,null,null,null,1,{"$f":"IF(Account!$AJ$2=0,0,SUM(Account!$AJ$2-$D169))","v":0},1,0,0,{"$f":"ROUND(SUM($L169*Account!$AI$2),2)","v":0},{"$f":"ROUND(SUM($M169*Account!$AH$2),2)","v":0},{"$f":"IF(Account!$Z$2=0,0,SUM(Account!$Z$2-$D169))","v":0},1,{"$f":"SUM(SUM(SUM(SUM($N169:$O169)/$I169*$P169)*Account!$Y$2)/100)","v":0},{"$f":"SUM(SUM(SUM(SUM($N169:$O169)/$I169*$Q169)*Account!$X$2)/100)","v":0},{"$f":"IF(Account!$AC$2=0,0,SUM(Account!$AC$2-$D169))","v":0},1,0,0,{"$f":"SUM($V169*Account!$AB$2)","v":0},{"$f":"SUM($W169*Account!$AA$2)","v":0},0]
[169,null,null,null,null,null,null,null,1,{"$f":"IF(Account!$AJ$2=0,0,SUM(Account!$AJ$2-$D170))","v":0},1,0,0,{"$f":"ROUND(SUM($L170*Account!$AI$2),2)","v":0},{"$f":"ROUND(SUM($M170*Account!$AH$2),2)","v":0},{"$f":"IF(Account!$Z$2=0,0,SUM(Account!$Z$2-$D170))","v":0},1,{"$f":"SUM(SUM(SUM(SUM($N170:$O170)/$I170*$P170)*Account!$Y$2)/100)","v":0},{"$f":"SUM(SUM(SUM(SUM($N170:$O170)/$I170*$Q170)*Account!$X$2)/100)","v":0},{"$f":"IF(Account!$AC$2=0,0,SUM(Account!$AC$2-$D170))","v":0},1,0,0,{"$f":"SUM($V170*Account!$AB$2)","v":0},{"$f":"SUM($W170*Account!$AA$2)","v":0},0]
[170,null,null,null,null,null,null,null,1,{"$f":"IF(Account!$AJ$2=0,0,SUM(Account!$AJ$2-$D171))","v":0},1,0,0,{"$f":"ROUND(SUM($L171*Account!$AI$2),2)","v":0},{"$f":"ROUND(SUM($M171*Account!$AH$2),2)","v":0},{"$f":"IF(Account!$Z$2=0,0,SUM(Account!$Z$2-$D171))","v":0},1,{"$f":"SUM(SUM(SUM(SUM($N171:$O171)/$I171*$P171)*Account!$Y$2)/100)","v":0},{"$f":"SUM(SUM(SUM(SUM($N171:$O171)/$I171*$Q171)*Account!$X$2)/100)","v":0},{"$f":"IF(Account!$AC$2=0,0,SUM(Account!$AC$2-$D171))","v":0},1,0,0,{"$f":"SUM($V171*Account!$AB$2)","v":0},{"$f":"SUM($W171*Account!$AA$2)","v":0},0]
[171,null,null,null,null,null,null,null,1,{"$f":"IF(Account!$AJ$2=0,0,SUM(Account!$AJ$2-$D172))","v":0},1,0,0,{"$f":"ROUND(SUM($L172*Account!$AI$2),2)","v":0},{"$f":"ROUND(SUM($M172*Account!$AH$2),2)","v":0},{"$f":"IF(Account!$Z$2=0,0,SUM(Account!$Z$2-$D172))","v":0},1,{"$f":"SUM(SUM(SUM(SUM($N172:$O172)/$I172*$P172)*Account!$Y$2)/100)","v":0},{"$f":"SUM(SUM(SUM(SUM($N172:$O172)/$I172*$Q172)*Account!$X$2)/100)","v":0},{"$f":"IF(Account!$AC$2=0,0,SUM(Account!$AC$2-$D172))","v":0},1,0,0,{"$f":"SUM($V172*Account!$AB$2)","v":0},{"$f":"SUM($W172*Account!$AA$2)","v":0},0]
[172,null,null,null,null,null,null,null,1,{"$f":"IF(Account!$AJ$2=0,0,SUM(Account!$AJ$2-$D173))","v":0},1,0,0,{"$f":"ROUND(SUM($L173*Account!$AI$2),2)","v":0},{"$f":"ROUND(SUM($M173*Account!$AH$2),2)","v":0},{"$f":"IF(Account!$Z$2=0,0,SUM(Account!$Z$2-$D173))","v":0},1,{"$f":"SUM(SUM(SUM(SUM($N173:$O173)/$I173*$P173)*Account!$Y$2)/100)","v":0},{"$f":"SUM(SUM(SUM(SUM($N173:$O173)/$I173*$Q173)*Account!$X$2)/100)","v":0},{"$f":"IF(Account!$AC$2=0,0,SUM(Account!$AC$2-$D173))","v":0},1,0,0,{"$f":"SUM($V173*Account!$AB$2)","v":0},{"$f":"SUM($W173*Account!$AA$2)","v":0},0]
[173,null,null,null,null,null,null,null,1,{"$f":"IF(Account!$AJ$2=0,0,SUM(Account!$AJ$2-$D174))","v":0},1,0,0,{"$f":"ROUND(SUM($L174*Account!$AI$2),2)","v":0},{"$f":"ROUND(SUM($M174*Account!$AH$2),2)","v":0},{"$f":"IF(Account!$Z$2=0,0,SUM(Account!$Z$2-$D174))","v":0},1,{"$f":"SUM(SUM(SUM(SUM($N174:$O174)/$I174*$P174)*Account!$Y$2)/100)","v":0},{"$f":"SUM(SUM(SUM(SUM($N174:$O174)/$I174*$Q174)*Account!$X$2)/100)","v":0},{"$f":"IF(Account!$AC$2=0,0,SUM(Account!$AC$2-$D174))","v":0},1,0,0,{"$f":"SUM($V174*Account!$AB$2)","v":0},{"$f":"SUM($W174*Account!$AA$2)","v":0},0]
[174,null,null,null,null,null,null,null,1,{"$f":"IF(Account!$AJ$2=0,0,SUM(Account!$AJ$2-$D175))","v":0},1,0,0,{"$f":"ROUND(SUM($L175*Account!$AI$2),2)","v":0},{"$f":"ROUND(SUM($M175*Account!$AH$2),2)","v":0},{"$f":"IF(Account!$Z$2=0,0,SUM(Account!$Z$2-$D175))","v":0},1,{"$f":"SUM(SUM(SUM(SUM($N175:$O175)/$I175*$P175)*Account!$Y$2)/100)","v":0},{"$f":"SUM(SUM(SUM(SUM($N175:$O175)/$I175*$Q175)*Account!$X$2)/100)","v":0},{"$f":"IF(Account!$AC$2=0,0,SUM(Account!$AC$2-$D175))","v":0},1,0,0,{"$f":"SUM($V175*Account!$AB$2)","v":0},{"$f":"SUM($W175*Account!$AA$2)","v":0},0]
[175,null,null,null,null,null,null,null,1,{"$f":"IF(Account!$AJ$2=0,0,SUM(Account!$AJ$2-$D176))","v":0},1,0,0,{"$f":"ROUND(SUM($L176*Account!$AI$2),2)","v":0},{"$f":"ROUND(SUM($M176*Account!$AH$2),2)","v":0},{"$f":"IF(Account!$Z$2=0,0,SUM(Account!$Z$2-$D176))","v":0},1,{"$f":"SUM(SUM(SUM(SUM($N176:$O176)/$I176*$P176)*Account!$Y$2)/100)","v":0},{"$f":"SUM(SUM(SUM(SUM($N176:$O176)/$I176*$Q176)*Account!$X$2)/100)","v":0},{"$f":"IF(Account!$AC$2=0,0,SUM(Account!$AC$2-$D176))","v":0},1,0,0,{"$f":"SUM($V176*Account!$AB$2)","v":0},{"$f":"SUM($W176*Account!$AA$2)","v":0},0]
[176,null,null,null,null,null,null,null,1,{"$f":"IF(Account!$AJ$2=0,0,SUM(Account!$AJ$2-$D177))","v":0},1,0,0,{"$f":"ROUND(SUM($L177*Account!$AI$2),2)","v":0},{"$f":"ROUND(SUM($M177*Account!$AH$2),2)","v":0},{"$f":"IF(Account!$Z$2=0,0,SUM(Account!$Z$2-$D177))","v":0},1,{"$f":"SUM(SUM(SUM(SUM($N177:$O177)/$I177*$P177)*Account!$Y$2)/100)","v":0},{"$f":"SUM(SUM(SUM(SUM($N177:$O177)/$I177*$Q177)*Account!$X$2)/100)","v":0},{"$f":"IF(Account!$AC$2=0,0,SUM(Account!$AC$2-$D177))","v":0},1,0,0,{"$f":"SUM($V177*Account!$AB$2)","v":0},{"$f":"SUM($W177*Account!$AA$2)","v":0},0]
[177,null,null,null,null,null,null,null,1,{"$f":"IF(Account!$AJ$2=0,0,SUM(Account!$AJ$2-$D178))","v":0},1,0,0,{"$f":"ROUND(SUM($L178*Account!$AI$2),2)","v":0},{"$f":"ROUND(SUM($M178*Account!$AH$2),2)","v":0},{"$f":"IF(Account!$Z$2=0,0,SUM(Account!$Z$2-$D178))","v":0},1,{"$f":"SUM(SUM(SUM(SUM($N178:$O178)/$I178*$P178)*Account!$Y$2)/100)","v":0},{"$f":"SUM(SUM(SUM(SUM($N178:$O178)/$I178*$Q178)*Account!$X$2)/100)","v":0},{"$f":"IF(Account!$AC$2=0,0,SUM(Account!$AC$2-$D178))","v":0},1,0,0,{"$f":"SUM($V178*Account!$AB$2)","v":0},{"$f":"SUM($W178*Account!$AA$2)","v":0},0]
[178,null,null,null,null,null,null,null,1,{"$f":"IF(Account!$AJ$2=0,0,SUM(Account!$AJ$2-$D179))","v":0},1,0,0,{"$f":"ROUND(SUM($L179*Account!$AI$2),2)","v":0},{"$f":"ROUND(SUM($M179*Account!$AH$2),2)","v":0},{"$f":"IF(Account!$Z$2=0,0,SUM(Account!$Z$2-$D179))","v":0},1,{"$f":"SUM(SUM(SUM(SUM($N179:$O179)/$I179*$P179)*Account!$Y$2)/100)","v":0},{"$f":"SUM(SUM(SUM(SUM($N179:$O179)/$I179*$Q179)*Account!$X$2)/100)","v":0},{"$f":"IF(Account!$AC$2=0,0,SUM(Account!$AC$2-$D179))","v":0},1,0,0,{"$f":"SUM($V179*Account!$AB$2)","v":0},{"$f":"SUM($W179*Account!$AA$2)","v":0},0]
[179,null,null,null,null,null,null,null,1,{"$f":"IF(Account!$AJ$2=0,0,SUM(Account!$AJ$2-$D180))","v":0},1,0,0,{"$f":"ROUND(SUM($L180*Account!$AI$2),2)","v":0},{"$f":"ROUND(SUM($M180*Account!$AH$2),2)","v":0},{"$f":"IF(Account!$Z$2=0,0,SUM(Account!$Z$2-$D180))","v":0},1,{"$f":"SUM(SUM(SUM(SUM($N180:$O180)/$I180*$P180)*Account!$Y$2)/100)","v":0},{"$f":"SUM(SUM(SUM(SUM($N180:$O180)/$I180*$Q180)*Account!$X$2)/100)","v":0},{"$f":"IF(Account!$AC$2=0,0,SUM(Account!$AC$2-$D180))","v":0},1,0,0,{"$f":"SUM($V180*Account!$AB$2)","v":0},{"$f":"SUM($W180*Account!$AA$2)","v":0},0]
[180,null,null,null,null,null,null,null,1,{"$f":"IF(Account!$AJ$2=0,0,SUM(Account!$AJ$2-$D181))","v":0},1,0,0,{"$f":"ROUND(SUM($L181*Account!$AI$2),2)","v":0},{"$f":"ROUND(SUM($M181*Account!$AH$2),2)","v":0},{"$f":"IF(Account!$Z$2=0,0,SUM(Account!$Z$2-$D181))","v":0},1,{"$f":"SUM(SUM(SUM(SUM($N181:$O181)/$I181*$P181)*Account!$Y$2)/100)","v":0},{"$f":"SUM(SUM(SUM(SUM($N181:$O181)/$I181*$Q181)*Account!$X$2)/100)","v":0},{"$f":"IF(Account!$AC$2=0,0,SUM(Account!$AC$2-$D181))","v":0},1,0,0,{"$f":"SUM($V181*Account!$AB$2)","v":0},{"$f":"SUM($W181*Account!$AA$2)","v":0},0]
[181,null,null,null,null,null,null,null,1,{"$f":"IF(Account!$AJ$2=0,0,SUM(Account!$AJ$2-$D182))","v":0},1,0,0,{"$f":"ROUND(SUM($L182*Account!$AI$2),2)","v":0},{"$f":"ROUND(SUM($M182*Account!$AH$2),2)","v":0},{"$f":"IF(Account!$Z$2=0,0,SUM(Account!$Z$2-$D182))","v":0},1,{"$f":"SUM(SUM(SUM(SUM($N182:$O182)/$I182*$P182)*Account!$Y$2)/100)","v":0},{"$f":"SUM(SUM(SUM(SUM($N182:$O182)/$I182*$Q182)*Account!$X$2)/100)","v":0},{"$f":"IF(Account!$AC$2=0,0,SUM(Account!$AC$2-$D182))","v":0},1,0,0,{"$f":"SUM($V182*Account!$AB$2)","v":0},{"$f":"SUM($W182*Account!$AA$2)","v":0},0]
[182,null,null,null,null,null,null,null,1,{"$f":"IF(Account!$AJ$2=0,0,SUM(Account!$AJ$2-$D183))","v":0},1,0,0,{"$f":"ROUND(SUM($L183*Account!$AI$2),2)","v":0},{"$f":"ROUND(SUM($M183*Account!$AH$2),2)","v":0},{"$f":"IF(Account!$Z$2=0,0,SUM(Account!$Z$2-$D183))","v":0},1,{"$f":"SUM(SUM(SUM(SUM($N183:$O183)/$I183*$P183)*Account!$Y$2)/100)","v":0},{"$f":"SUM(SUM(SUM(SUM($N183:$O183)/$I183*$Q183)*Account!$X$2)/100)","v":0},{"$f":"IF(Account!$AC$2=0,0,SUM(Account!$AC$2-$D183))","v":0},1,0,0,{"$f":"SUM($V183*Account!$AB$2)","v":0},{"$f":"SUM($W183*Account!$AA$2)","v":0},0]
[183,null,null,null,null,null,null,null,1,{"$f":"IF(Account!$AJ$2=0,0,SUM(Account!$AJ$2-$D184))","v":0},1,0,0,{"$f":"ROUND(SUM($L184*Account!$AI$2),2)","v":0},{"$f":"ROUND(SUM($M184*Account!$AH$2),2)","v":0},{"$f":"IF(Account!$Z$2=0,0,SUM(Account!$Z$2-$D184))","v":0},1,{"$f":"SUM(SUM(SUM(SUM($N184:$O184)/$I184*$P184)*Account!$Y$2)/100)","v":0},{"$f":"SUM(SUM(SUM(SUM($N184:$O184)/$I184*$Q184)*Account!$X$2)/100)","v":0},{"$f":"IF(Account!$AC$2=0,0,SUM(Account!$AC$2-$D184))","v":0},1,0,0,{"$f":"SUM($V184*Account!$AB$2)","v":0},{"$f":"SUM($W184*Account!$AA$2)","v":0},0]
[184,null,null,null,null,null,null,null,1,{"$f":"IF(Account!$AJ$2=0,0,SUM(Account!$AJ$2-$D185))","v":0},1,0,0,{"$f":"ROUND(SUM($L185*Account!$AI$2),2)","v":0},{"$f":"ROUND(SUM($M185*Account!$AH$2),2)","v":0},{"$f":"IF(Account!$Z$2=0,0,SUM(Account!$Z$2-$D185))","v":0},1,{"$f":"SUM(SUM(SUM(SUM($N185:$O185)/$I185*$P185)*Account!$Y$2)/100)","v":0},{"$f":"SUM(SUM(SUM(SUM($N185:$O185)/$I185*$Q185)*Account!$X$2)/100)","v":0},{"$f":"IF(Account!$AC$2=0,0,SUM(Account!$AC$2-$D185))","v":0},1,0,0,{"$f":"SUM($V185*Account!$AB$2)","v":0},{"$f":"SUM($W185*Account!$AA$2)","v":0},0]
[185,null,null,null,null,null,null,null,1,{"$f":"IF(Account!$AJ$2=0,0,SUM(Account!$AJ$2-$D186))","v":0},1,0,0,{"$f":"ROUND(SUM($L186*Account!$AI$2),2)","v":0},{"$f":"ROUND(SUM($M186*Account!$AH$2),2)","v":0},{"$f":"IF(Account!$Z$2=0,0,SUM(Account!$Z$2-$D186))","v":0},1,{"$f":"SUM(SUM(SUM(SUM($N186:$O186)/$I186*$P186)*Account!$Y$2)/100)","v":0},{"$f":"SUM(SUM(SUM(SUM($N186:$O186)/$I186*$Q186)*Account!$X$2)/100)","v":0},{"$f":"IF(Account!$AC$2=0,0,SUM(Account!$AC$2-$D186))","v":0},1,0,0,{"$f":"SUM($V186*Account!$AB$2)","v":0},{"$f":"SUM($W186*Account!$AA$2)","v":0},0]
[186,null,null,null,null,null,null,null,1,{"$f":"IF(Account!$AJ$2=0,0,SUM(Account!$AJ$2-$D187))","v":0},1,0,0,{"$f":"ROUND(SUM($L187*Account!$AI$2),2)","v":0},{"$f":"ROUND(SUM($M187*Account!$AH$2),2)","v":0},{"$f":"IF(Account!$Z$2=0,0,SUM(Account!$Z$2-$D187))","v":0},1,{"$f":"SUM(SUM(SUM(SUM($N187:$O187)/$I187*$P187)*Account!$Y$2)/100)","v":0},{"$f":"SUM(SUM(SUM(SUM($N187:$O187)/$I187*$Q187)*Account!$X$2)/100)","v":0},{"$f":"IF(Account!$AC$2=0,0,SUM(Account!$AC$2-$D187))","v":0},1,0,0,{"$f":"SUM($V187*Account!$AB$2)","v":0},{"$f":"SUM($W187*Account!$AA$2)","v":0},0]
[187,null,null,null,null,null,null,null,1,{"$f":"IF(Account!$AJ$2=0,0,SUM(Account!$AJ$2-$D188))","v":0},1,0,0,{"$f":"ROUND(SUM($L188*Account!$AI$2),2)","v":0},{"$f":"ROUND(SUM($M188*Account!$AH$2),2)","v":0},{"$f":"IF(Account!$Z$2=0,0,SUM(Account!$Z$2-$D188))","v":0},1,{"$f":"SUM(SUM(SUM(SUM($N188:$O188)/$I188*$P188)*Account!$Y$2)/100)","v":0},{"$f":"SUM(SUM(SUM(SUM($N188:$O188)/$I188*$Q188)*Account!$X$2)/100)","v":0},{"$f":"IF(Account!$AC$2=0,0,SUM(Account!$AC$2-$D188))","v":0},1,0,0,{"$f":"SUM($V188*Account!$AB$2)","v":0},{"$f":"SUM($W188*Account!$AA$2)","v":0},0]
[188,null,null,null,null,null,null,null,1,{"$f":"IF(Account!$AJ$2=0,0,SUM(Account!$AJ$2-$D189))","v":0},1,0,0,{"$f":"ROUND(SUM($L189*Account!$AI$2),2)","v":0},{"$f":"ROUND(SUM($M189*Account!$AH$2),2)","v":0},{"$f":"IF(Account!$Z$2=0,0,SUM(Account!$Z$2-$D189))","v":0},1,{"$f":"SUM(SUM(SUM(SUM($N189:$O189)/$I189*$P189)*Account!$Y$2)/100)","v":0},{"$f":"SUM(SUM(SUM(SUM($N189:$O189)/$I189*$Q189)*Account!$X$2)/100)","v":0},{"$f":"IF(Account!$AC$2=0,0,SUM(Account!$AC$2-$D189))","v":0},1,0,0,{"$f":"SUM($V189*Account!$AB$2)","v":0},{"$f":"SUM($W189*Account!$AA$2)","v":0},0]
[189,null,null,null,null,null,null,null,1,{"$f":"IF(Account!$AJ$2=0,0,SUM(Account!$AJ$2-$D190))","v":0},1,0,0,{"$f":"ROUND(SUM($L190*Account!$AI$2),2)","v":0},{"$f":"ROUND(SUM($M190*Account!$AH$2),2)","v":0},{"$f":"IF(Account!$Z$2=0,0,SUM(Account!$Z$2-$D190))","v":0},1,{"$f":"SUM(SUM(SUM(SUM($N190:$O190)/$I190*$P190)*Account!$Y$2)/100)","v":0},{"$f":"SUM(SUM(SUM(SUM($N190:$O190)/$I190*$Q190)*Account!$X$2)/100)","v":0},{"$f":"IF(Account!$AC$2=0,0,SUM(Account!$AC$2-$D190))","v":0},1,0,0,{"$f":"SUM($V190*Account!$AB$2)","v":0},{"$f":"SUM($W190*Account!$AA$2)","v":0},0]
[190,null,null,null,null,null,null,null,1,{"$f":"IF(Account!$AJ$2=0,0,SUM(Account!$AJ$2-$D191))","v":0},1,0,0,{"$f":"ROUND(SUM($L191*Account!$AI$2),2)","v":0},{"$f":"ROUND(SUM($M191*Account!$AH$2),2)","v":0},{"$f":"IF(Account!$Z$2=0,0,SUM(Account!$Z$2-$D191))","v":0},1,{"$f":"SUM(SUM(SUM(SUM($N191:$O191)/$I191*$P191)*Account!$Y$2)/100)","v":0},{"$f":"SUM(SUM(SUM(SUM($N191:$O191)/$I191*$Q191)*Account!$X$2)/100)","v":0},{"$f":"IF(Account!$AC$2=0,0,SUM(Account!$AC$2-$D191))","v":0},1,0,0,{"$f":"SUM($V191*Account!$AB$2)","v":0},{"$f":"SUM($W191*Account!$AA$2)","v":0},0]
[191,null,null,null,null,null,null,null,1,{"$f":"IF(Account!$AJ$2=0,0,SUM(Account!$AJ$2-$D192))","v":0},1,0,0,{"$f":"ROUND(SUM($L192*Account!$AI$2),2)","v":0},{"$f":"ROUND(SUM($M192*Account!$AH$2),2)","v":0},{"$f":"IF(Account!$Z$2=0,0,SUM(Account!$Z$2-$D192))","v":0},1,{"$f":"SUM(SUM(SUM(SUM($N192:$O192)/$I192*$P192)*Account!$Y$2)/100)","v":0},{"$f":"SUM(SUM(SUM(SUM($N192:$O192)/$I192*$Q192)*Account!$X$2)/100)","v":0},{"$f":"IF(Account!$AC$2=0,0,SUM(Account!$AC$2-$D192))","v":0},1,0,0,{"$f":"SUM($V192*Account!$AB$2)","v":0},{"$f":"SUM($W192*Account!$AA$2)","v":0},0]
[192,null,null,null,null,null,null,null,1,{"$f":"IF(Account!$AJ$2=0,0,SUM(Account!$AJ$2-$D193))","v":0},1,0,0,{"$f":"ROUND(SUM($L193*Account!$AI$2),2)","v":0},{"$f":"ROUND(SUM($M193*Account!$AH$2),2)","v":0},{"$f":"IF(Account!$Z$2=0,0,SUM(Account!$Z$2-$D193))","v":0},1,{"$f":"SUM(SUM(SUM(SUM($N193:$O193)/$I193*$P193)*Account!$Y$2)/100)","v":0},{"$f":"SUM(SUM(SUM(SUM($N193:$O193)/$I193*$Q193)*Account!$X$2)/100)","v":0},{"$f":"IF(Account!$AC$2=0,0,SUM(Account!$AC$2-$D193))","v":0},1,0,0,{"$f":"SUM($V193*Account!$AB$2)","v":0},{"$f":"SUM($W193*Account!$AA$2)","v":0},0]
[193,null,null,null,null,null,null,null,1,{"$f":"IF(Account!$AJ$2=0,0,SUM(Account!$AJ$2-$D194))","v":0},{"$f":"SUM($I194-$J194)","v":1},0,0,{"$f":"ROUND(SUM($L194*Account!$AI$2),2)","v":0},{"$f":"ROUND(SUM($M194*Account!$AH$2),2)","v":0},{"$f":"IF(Account!$Z$2=0,0,SUM(Account!$Z$2-$D194))","v":0},{"$f":"SUM($I194-$P194)","v":1},{"$f":"SUM(SUM(SUM(SUM($N194:$O194)/$I194*$P194)*Account!$Y$2)/100)","v":0},{"$f":"SUM(SUM(SUM(SUM($N194:$O194)/$I194*$Q194)*Account!$X$2)/100)","v":0},{"$f":"IF(Account!$AC$2=0,0,SUM(Account!$AC$2-$D194))","v":0},{"$f":"SUM($I194-$T194)","v":1},0,0,{"$f":"SUM($V194*Account!$AB$2)","v":0},{"$f":"SUM($W194*Account!$AA$2)","v":0},0]
[194,null,null,null,null,null,null,null,{"$f":"SUM($E195-$D195+1)","v":1},{"$f":"IF(Account!$AJ$2=0,0,SUM(Account!$AJ$2-$D195))","v":0},1,{"$f":"ROUND(IF($J195=0,0,SUM($H195/$I195*$K195)),2)","v":0},{"$f":"ROUND(SUM($H195-$L195),2)","v":0},{"$f":"ROUND(SUM($L195*Account!$AI$2),2)","v":0},{"$f":"ROUND(SUM($M195*Account!$AH$2),2)","v":0},{"$f":"IF(Account!$Z$2=0,0,SUM(Account!$Z$2-$D195))","v":0},1,{"$f":"SUM(SUM(SUM(SUM($N195:$O195)/$I195*$P195)*Account!$Y$2)/100)","v":0},{"$f":"SUM(SUM(SUM(SUM($N195:$O195)/$I195*$Q195)*Account!$X$2)/100)","v":0},{"$f":"IF(Account!$AC$2=0,0,SUM(Account!$AC$2-$D195))","v":0},1,{"$f":"ROUND(IF($T195=0,0,SUM($H195/$I195*$T195)),2)","v":0},{"$f":"ROUND(SUM($H195-$V195),2)","v":0},{"$f":"SUM($V195*Account!$AB$2)","v":0},{"$f":"SUM($W195*Account!$AA$2)","v":0},{"$f":"SUM($N195:$O195,$R195:$S195,$X195:$Y195)","v":0}]
[195,null,null,null,null,null,null,null,1,{"$f":"IF(Account!$AJ$2=0,0,SUM(Account!$AJ$2-$D196))","v":0},1,0,0,{"$f":"ROUND(SUM($L196*Account!$AI$2),2)","v":0},{"$f":"ROUND(SUM($M196*Account!$AH$2),2)","v":0},{"$f":"IF(Account!$Z$2=0,0,SUM(Account!$Z$2-$D196))","v":0},1,{"$f":"SUM(SUM(SUM(SUM($N196:$O196)/$I196*$P196)*Account!$Y$2)/100)","v":0},{"$f":"SUM(SUM(SUM(SUM($N196:$O196)/$I196*$Q196)*Account!$X$2)/100)","v":0},{"$f":"IF(Account!$AC$2=0,0,SUM(Account!$AC$2-$D196))","v":0},1,0,0,{"$f":"SUM($V196*Account!$AB$2)","v":0},{"$f":"SUM($W196*Account!$AA$2)","v":0},0]
[196,null,null,null,null,null,null,null,1,{"$f":"IF(Account!$AJ$2=0,0,SUM(Account!$AJ$2-$D197))","v":0},1,0,0,{"$f":"ROUND(SUM($L197*Account!$AI$2),2)","v":0},{"$f":"ROUND(SUM($M197*Account!$AH$2),2)","v":0},{"$f":"IF(Account!$Z$2=0,0,SUM(Account!$Z$2-$D197))","v":0},1,{"$f":"SUM(SUM(SUM(SUM($N197:$O197)/$I197*$P197)*Account!$Y$2)/100)","v":0},{"$f":"SUM(SUM(SUM(SUM($N197:$O197)/$I197*$Q197)*Account!$X$2)/100)","v":0},{"$f":"IF(Account!$AC$2=0,0,SUM(Account!$AC$2-$D197))","v":0},1,0,0,{"$f":"SUM($V197*Account!$AB$2)","v":0},{"$f":"SUM($W197*Account!$AA$2)","v":0},0]
[197,null,null,null,null,null,null,null,1,{"$f":"IF(Account!$AJ$2=0,0,SUM(Account!$AJ$2-$D198))","v":0},1,0,0,{"$f":"ROUND(SUM($L198*Account!$AI$2),2)","v":0},{"$f":"ROUND(SUM($M198*Account!$AH$2),2)","v":0},{"$f":"IF(Account!$Z$2=0,0,SUM(Account!$Z$2-$D198))","v":0},1,{"$f":"SUM(SUM(SUM(SUM($N198:$O198)/$I198*$P198)*Account!$Y$2)/100)","v":0},{"$f":"SUM(SUM(SUM(SUM($N198:$O198)/$I198*$Q198)*Account!$X$2)/100)","v":0},{"$f":"IF(Account!$AC$2=0,0,SUM(Account!$AC$2-$D198))","v":0},1,0,0,{"$f":"SUM($V198*Account!$AB$2)","v":0},{"$f":"SUM($W198*Account!$AA$2)","v":0},0]
[198,null,null,null,null,null,null,null,1,{"$f":"IF(Account!$AJ$2=0,0,SUM(Account!$AJ$2-$D199))","v":0},1,0,0,{"$f":"ROUND(SUM($L199*Account!$AI$2),2)","v":0},{"$f":"ROUND(SUM($M199*Account!$AH$2),2)","v":0},{"$f":"IF(Account!$Z$2=0,0,SUM(Account!$Z$2-$D199))","v":0},1,{"$f":"SUM(SUM(SUM(SUM($N199:$O199)/$I199*$P199)*Account!$Y$2)/100)","v":0},{"$f":"SUM(SUM(SUM(SUM($N199:$O199)/$I199*$Q199)*Account!$X$2)/100)","v":0},{"$f":"IF(Account!$AC$2=0,0,SUM(Account!$AC$2-$D199))","v":0},1,0,0,{"$f":"SUM($V199*Account!$AB$2)","v":0},{"$f":"SUM($W199*Account!$AA$2)","v":0},0]
[199,null,null,null,null,null,null,null,1,{"$f":"IF(Account!$AJ$2=0,0,SUM(Account!$AJ$2-$D200))","v":0},1,0,0,{"$f":"ROUND(SUM($L200*Account!$AI$2),2)","v":0},{"$f":"ROUND(SUM($M200*Account!$AH$2),2)","v":0},{"$f":"IF(Account!$Z$2=0,0,SUM(Account!$Z$2-$D200))","v":0},1,{"$f":"SUM(SUM(SUM(SUM($N200:$O200)/$I200*$P200)*Account!$Y$2)/100)","v":0},{"$f":"SUM(SUM(SUM(SUM($N200:$O200)/$I200*$Q200)*Account!$X$2)/100)","v":0},{"$f":"IF(Account!$AC$2=0,0,SUM(Account!$AC$2-$D200))","v":0},1,0,0,{"$f":"SUM($V200*Account!$AB$2)","v":0},{"$f":"SUM($W200*Account!$AA$2)","v":0},0]
[200,null,null,null,null,null,null,null,1,{"$f":"IF(Account!$AJ$2=0,0,SUM(Account!$AJ$2-$D201))","v":0},1,0,0,{"$f":"ROUND(SUM($L201*Account!$AI$2),2)","v":0},{"$f":"ROUND(SUM($M201*Account!$AH$2),2)","v":0},{"$f":"IF(Account!$Z$2=0,0,SUM(Account!$Z$2-$D201))","v":0},1,{"$f":"SUM(SUM(SUM(SUM($N201:$O201)/$I201*$P201)*Account!$Y$2)/100)","v":0},{"$f":"SUM(SUM(SUM(SUM($N201:$O201)/$I201*$Q201)*Account!$X$2)/100)","v":0},{"$f":"IF(Account!$AC$2=0,0,SUM(Account!$AC$2-$D201))","v":0},1,0,0,{"$f":"SUM($V201*Account!$AB$2)","v":0},{"$f":"SUM($W201*Account!$AA$2)","v":0},0]
[201,null,null,null,null,null,null,null,1,{"$f":"IF(Account!$AJ$2=0,0,SUM(Account!$AJ$2-$D202))","v":0},1,0,0,{"$f":"ROUND(SUM($L202*Account!$AI$2),2)","v":0},{"$f":"ROUND(SUM($M202*Account!$AH$2),2)","v":0},{"$f":"IF(Account!$Z$2=0,0,SUM(Account!$Z$2-$D202))","v":0},1,{"$f":"SUM(SUM(SUM(SUM($N202:$O202)/$I202*$P202)*Account!$Y$2)/100)","v":0},{"$f":"SUM(SUM(SUM(SUM($N202:$O202)/$I202*$Q202)*Account!$X$2)/100)","v":0},{"$f":"IF(Account!$AC$2=0,0,SUM(Account!$AC$2-$D202))","v":0},1,0,0,{"$f":"SUM($V202*Account!$AB$2)","v":0},{"$f":"SUM($W202*Account!$AA$2)","v":0},0]
[202,null,null,null,null,null,null,null,1,{"$f":"IF(Account!$AJ$2=0,0,SUM(Account!$AJ$2-$D203))","v":0},1,0,0,{"$f":"ROUND(SUM($L203*Account!$AI$2),2)","v":0},{"$f":"ROUND(SUM($M203*Account!$AH$2),2)","v":0},{"$f":"IF(Account!$Z$2=0,0,SUM(Account!$Z$2-$D203))","v":0},1,{"$f":"SUM(SUM(SUM(SUM($N203:$O203)/$I203*$P203)*Account!$Y$2)/100)","v":0},{"$f":"SUM(SUM(SUM(SUM($N203:$O203)/$I203*$Q203)*Account!$X$2)/100)","v":0},{"$f":"IF(Account!$AC$2=0,0,SUM(Account!$AC$2-$D203))","v":0},1,0,0,{"$f":"SUM($V203*Account!$AB$2)","v":0},{"$f":"SUM($W203*Account!$AA$2)","v":0},0]
[203,null,null,null,null,null,null,null,1,{"$f":"IF(Account!$AJ$2=0,0,SUM(Account!$AJ$2-$D204))","v":0},1,0,0,{"$f":"ROUND(SUM($L204*Account!$AI$2),2)","v":0},{"$f":"ROUND(SUM($M204*Account!$AH$2),2)","v":0},{"$f":"IF(Account!$Z$2=0,0,SUM(Account!$Z$2-$D204))","v":0},1,{"$f":"SUM(SUM(SUM(SUM($N204:$O204)/$I204*$P204)*Account!$Y$2)/100)","v":0},{"$f":"SUM(SUM(SUM(SUM($N204:$O204)/$I204*$Q204)*Account!$X$2)/100)","v":0},{"$f":"IF(Account!$AC$2=0,0,SUM(Account!$AC$2-$D204))","v":0},1,0,0,{"$f":"SUM($V204*Account!$AB$2)","v":0},{"$f":"SUM($W204*Account!$AA$2)","v":0},0]
[204,null,null,null,null,null,null,null,1,{"$f":"IF(Account!$AJ$2=0,0,SUM(Account!$AJ$2-$D205))","v":0},1,0,0,{"$f":"ROUND(SUM($L205*Account!$AI$2),2)","v":0},{"$f":"ROUND(SUM($M205*Account!$AH$2),2)","v":0},{"$f":"IF(Account!$Z$2=0,0,SUM(Account!$Z$2-$D205))","v":0},1,{"$f":"SUM(SUM(SUM(SUM($N205:$O205)/$I205*$P205)*Account!$Y$2)/100)","v":0},{"$f":"SUM(SUM(SUM(SUM($N205:$O205)/$I205*$Q205)*Account!$X$2)/100)","v":0},{"$f":"IF(Account!$AC$2=0,0,SUM(Account!$AC$2-$D205))","v":0},1,0,0,{"$f":"SUM($V205*Account!$AB$2)","v":0},{"$f":"SUM($W205*Account!$AA$2)","v":0},0]
[205,null,null,null,null,null,null,null,1,{"$f":"IF(Account!$AJ$2=0,0,SUM(Account!$AJ$2-$D206))","v":0},1,0,0,{"$f":"ROUND(SUM($L206*Account!$AI$2),2)","v":0},{"$f":"ROUND(SUM($M206*Account!$AH$2),2)","v":0},{"$f":"IF(Account!$Z$2=0,0,SUM(Account!$Z$2-$D206))","v":0},1,{"$f":"SUM(SUM(SUM(SUM($N206:$O206)/$I206*$P206)*Account!$Y$2)/100)","v":0},{"$f":"SUM(SUM(SUM(SUM($N206:$O206)/$I206*$Q206)*Account!$X$2)/100)","v":0},{"$f":"IF(Account!$AC$2=0,0,SUM(Account!$AC$2-$D206))","v":0},1,0,0,{"$f":"SUM($V206*Account!$AB$2)","v":0},{"$f":"SUM($W206*Account!$AA$2)","v":0},0]
[206,null,null,null,null,null,null,null,1,{"$f":"IF(Account!$AJ$2=0,0,SUM(Account!$AJ$2-$D207))","v":0},1,0,0,{"$f":"ROUND(SUM($L207*Account!$AI$2),2)","v":0},{"$f":"ROUND(SUM($M207*Account!$AH$2),2)","v":0},{"$f":"IF(Account!$Z$2=0,0,SUM(Account!$Z$2-$D207))","v":0},1,{"$f":"SUM(SUM(SUM(SUM($N207:$O207)/$I207*$P207)*Account!$Y$2)/100)","v":0},{"$f":"SUM(SUM(SUM(SUM($N207:$O207)/$I207*$Q207)*Account!$X$2)/100)","v":0},{"$f":"IF(Account!$AC$2=0,0,SUM(Account!$AC$2-$D207))","v":0},1,0,0,{"$f":"SUM($V207*Account!$AB$2)","v":0},{"$f":"SUM($W207*Account!$AA$2)","v":0},0]
[207,null,null,null,null,null,null,null,1,{"$f":"IF(Account!$AJ$2=0,0,SUM(Account!$AJ$2-$D208))","v":0},1,0,0,{"$f":"ROUND(SUM($L208*Account!$AI$2),2)","v":0},{"$f":"ROUND(SUM($M208*Account!$AH$2),2)","v":0},{"$f":"IF(Account!$Z$2=0,0,SUM(Account!$Z$2-$D208))","v":0},1,{"$f":"SUM(SUM(SUM(SUM($N208:$O208)/$I208*$P208)*Account!$Y$2)/100)","v":0},{"$f":"SUM(SUM(SUM(SUM($N208:$O208)/$I208*$Q208)*Account!$X$2)/100)","v":0},{"$f":"IF(Account!$AC$2=0,0,SUM(Account!$AC$2-$D208))","v":0},1,0,0,{"$f":"SUM($V208*Account!$AB$2)","v":0},{"$f":"SUM($W208*Account!$AA$2)","v":0},0]
[208,null,null,null,null,null,null,null,1,{"$f":"IF(Account!$AJ$2=0,0,SUM(Account!$AJ$2-$D209))","v":0},1,0,0,{"$f":"ROUND(SUM($L209*Account!$AI$2),2)","v":0},{"$f":"ROUND(SUM($M209*Account!$AH$2),2)","v":0},{"$f":"IF(Account!$Z$2=0,0,SUM(Account!$Z$2-$D209))","v":0},1,{"$f":"SUM(SUM(SUM(SUM($N209:$O209)/$I209*$P209)*Account!$Y$2)/100)","v":0},{"$f":"SUM(SUM(SUM(SUM($N209:$O209)/$I209*$Q209)*Account!$X$2)/100)","v":0},{"$f":"IF(Account!$AC$2=0,0,SUM(Account!$AC$2-$D209))","v":0},1,0,0,{"$f":"SUM($V209*Account!$AB$2)","v":0},{"$f":"SUM($W209*Account!$AA$2)","v":0},0]
[209,null,null,null,null,null,null,null,1,{"$f":"IF(Account!$AJ$2=0,0,SUM(Account!$AJ$2-$D210))","v":0},1,0,0,{"$f":"ROUND(SUM($L210*Account!$AI$2),2)","v":0},{"$f":"ROUND(SUM($M210*Account!$AH$2),2)","v":0},{"$f":"IF(Account!$Z$2=0,0,SUM(Account!$Z$2-$D210))","v":0},1,{"$f":"SUM(SUM(SUM(SUM($N210:$O210)/$I210*$P210)*Account!$Y$2)/100)","v":0},{"$f":"SUM(SUM(SUM(SUM($N210:$O210)/$I210*$Q210)*Account!$X$2)/100)","v":0},{"$f":"IF(Account!$AC$2=0,0,SUM(Account!$AC$2-$D210))","v":0},1,0,0,{"$f":"SUM($V210*Account!$AB$2)","v":0},{"$f":"SUM($W210*Account!$AA$2)","v":0},0]
[210,null,null,null,null,null,null,null,1,{"$f":"IF(Account!$AJ$2=0,0,SUM(Account!$AJ$2-$D211))","v":0},1,0,0,{"$f":"ROUND(SUM($L211*Account!$AI$2),2)","v":0},{"$f":"ROUND(SUM($M211*Account!$AH$2),2)","v":0},{"$f":"IF(Account!$Z$2=0,0,SUM(Account!$Z$2-$D211))","v":0},1,{"$f":"SUM(SUM(SUM(SUM($N211:$O211)/$I211*$P211)*Account!$Y$2)/100)","v":0},{"$f":"SUM(SUM(SUM(SUM($N211:$O211)/$I211*$Q211)*Account!$X$2)/100)","v":0},{"$f":"IF(Account!$AC$2=0,0,SUM(Account!$AC$2-$D211))","v":0},1,0,0,{"$f":"SUM($V211*Account!$AB$2)","v":0},{"$f":"SUM($W211*Account!$AA$2)","v":0},0]
[211,null,null,null,null,null,null,null,1,{"$f":"IF(Account!$AJ$2=0,0,SUM(Account!$AJ$2-$D212))","v":0},1,0,0,{"$f":"ROUND(SUM($L212*Account!$AI$2),2)","v":0},{"$f":"ROUND(SUM($M212*Account!$AH$2),2)","v":0},{"$f":"IF(Account!$Z$2=0,0,SUM(Account!$Z$2-$D212))","v":0},1,{"$f":"SUM(SUM(SUM(SUM($N212:$O212)/$I212*$P212)*Account!$Y$2)/100)","v":0},{"$f":"SUM(SUM(SUM(SUM($N212:$O212)/$I212*$Q212)*Account!$X$2)/100)","v":0},{"$f":"IF(Account!$AC$2=0,0,SUM(Account!$AC$2-$D212))","v":0},1,0,0,{"$f":"SUM($V212*Account!$AB$2)","v":0},{"$f":"SUM($W212*Account!$AA$2)","v":0},0]
[212,null,null,null,null,null,null,null,1,{"$f":"IF(Account!$AJ$2=0,0,SUM(Account!$AJ$2-$D213))","v":0},1,0,0,{"$f":"ROUND(SUM($L213*Account!$AI$2),2)","v":0},{"$f":"ROUND(SUM($M213*Account!$AH$2),2)","v":0},{"$f":"IF(Account!$Z$2=0,0,SUM(Account!$Z$2-$D213))","v":0},1,{"$f":"SUM(SUM(SUM(SUM($N213:$O213)/$I213*$P213)*Account!$Y$2)/100)","v":0},{"$f":"SUM(SUM(SUM(SUM($N213:$O213)/$I213*$Q213)*Account!$X$2)/100)","v":0},{"$f":"IF(Account!$AC$2=0,0,SUM(Account!$AC$2-$D213))","v":0},1,0,0,{"$f":"SUM($V213*Account!$AB$2)","v":0},{"$f":"SUM($W213*Account!$AA$2)","v":0},0]
[213,null,null,null,null,null,null,null,1,{"$f":"IF(Account!$AJ$2=0,0,SUM(Account!$AJ$2-$D214))","v":0},1,0,0,{"$f":"ROUND(SUM($L214*Account!$AI$2),2)","v":0},{"$f":"ROUND(SUM($M214*Account!$AH$2),2)","v":0},{"$f":"IF(Account!$Z$2=0,0,SUM(Account!$Z$2-$D214))","v":0},1,{"$f":"SUM(SUM(SUM(SUM($N214:$O214)/$I214*$P214)*Account!$Y$2)/100)","v":0},{"$f":"SUM(SUM(SUM(SUM($N214:$O214)/$I214*$Q214)*Account!$X$2)/100)","v":0},{"$f":"IF(Account!$AC$2=0,0,SUM(Account!$AC$2-$D214))","v":0},1,0,0,{"$f":"SUM($V214*Account!$AB$2)","v":0},{"$f":"SUM($W214*Account!$AA$2)","v":0},0]
[214,null,null,null,null,null,null,null,1,{"$f":"IF(Account!$AJ$2=0,0,SUM(Account!$AJ$2-$D215))","v":0},1,0,0,{"$f":"ROUND(SUM($L215*Account!$AI$2),2)","v":0},{"$f":"ROUND(SUM($M215*Account!$AH$2),2)","v":0},{"$f":"IF(Account!$Z$2=0,0,SUM(Account!$Z$2-$D215))","v":0},1,{"$f":"SUM(SUM(SUM(SUM($N215:$O215)/$I215*$P215)*Account!$Y$2)/100)","v":0},{"$f":"SUM(SUM(SUM(SUM($N215:$O215)/$I215*$Q215)*Account!$X$2)/100)","v":0},{"$f":"IF(Account!$AC$2=0,0,SUM(Account!$AC$2-$D215))","v":0},1,0,0,{"$f":"SUM($V215*Account!$AB$2)","v":0},{"$f":"SUM($W215*Account!$AA$2)","v":0},0]
[215,null,null,null,null,null,null,null,1,{"$f":"IF(Account!$AJ$2=0,0,SUM(Account!$AJ$2-$D216))","v":0},1,0,0,{"$f":"ROUND(SUM($L216*Account!$AI$2),2)","v":0},{"$f":"ROUND(SUM($M216*Account!$AH$2),2)","v":0},{"$f":"IF(Account!$Z$2=0,0,SUM(Account!$Z$2-$D216))","v":0},1,{"$f":"SUM(SUM(SUM(SUM($N216:$O216)/$I216*$P216)*Account!$Y$2)/100)","v":0},{"$f":"SUM(SUM(SUM(SUM($N216:$O216)/$I216*$Q216)*Account!$X$2)/100)","v":0},{"$f":"IF(Account!$AC$2=0,0,SUM(Account!$AC$2-$D216))","v":0},1,0,0,{"$f":"SUM($V216*Account!$AB$2)","v":0},{"$f":"SUM($W216*Account!$AA$2)","v":0},0]
[216,null,null,null,null,null,null,null,1,{"$f":"IF(Account!$AJ$2=0,0,SUM(Account!$AJ$2-$D217))","v":0},1,0,0,{"$f":"ROUND(SUM($L217*Account!$AI$2),2)","v":0},{"$f":"ROUND(SUM($M217*Account!$AH$2),2)","v":0},{"$f":"IF(Account!$Z$2=0,0,SUM(Account!$Z$2-$D217))","v":0},1,{"$f":"SUM(SUM(SUM(SUM($N217:$O217)/$I217*$P217)*Account!$Y$2)/100)","v":0},{"$f":"SUM(SUM(SUM(SUM($N217:$O217)/$I217*$Q217)*Account!$X$2)/100)","v":0},{"$f":"IF(Account!$AC$2=0,0,SUM(Account!$AC$2-$D217))","v":0},1,0,0,{"$f":"SUM($V217*Account!$AB$2)","v":0},{"$f":"SUM($W217*Account!$AA$2)","v":0},0]
[217,null,null,null,null,null,null,null,1,{"$f":"IF(Account!$AJ$2=0,0,SUM(Account!$AJ$2-$D218))","v":0},1,0,0,{"$f":"ROUND(SUM($L218*Account!$AI$2),2)","v":0},{"$f":"ROUND(SUM($M218*Account!$AH$2),2)","v":0},{"$f":"IF(Account!$Z$2=0,0,SUM(Account!$Z$2-$D218))","v":0},1,{"$f":"SUM(SUM(SUM(SUM($N218:$O218)/$I218*$P218)*Account!$Y$2)/100)","v":0},{"$f":"SUM(SUM(SUM(SUM($N218:$O218)/$I218*$Q218)*Account!$X$2)/100)","v":0},{"$f":"IF(Account!$AC$2=0,0,SUM(Account!$AC$2-$D218))","v":0},1,0,0,{"$f":"SUM($V218*Account!$AB$2)","v":0},{"$f":"SUM($W218*Account!$AA$2)","v":0},0]
[218,null,null,null,null,null,null,null,1,{"$f":"IF(Account!$AJ$2=0,0,SUM(Account!$AJ$2-$D219))","v":0},1,0,0,{"$f":"ROUND(SUM($L219*Account!$AI$2),2)","v":0},{"$f":"ROUND(SUM($M219*Account!$AH$2),2)","v":0},{"$f":"IF(Account!$Z$2=0,0,SUM(Account!$Z$2-$D219))","v":0},1,{"$f":"SUM(SUM(SUM(SUM($N219:$O219)/$I219*$P219)*Account!$Y$2)/100)","v":0},{"$f":"SUM(SUM(SUM(SUM($N219:$O219)/$I219*$Q219)*Account!$X$2)/100)","v":0},{"$f":"IF(Account!$AC$2=0,0,SUM(Account!$AC$2-$D219))","v":0},1,0,0,{"$f":"SUM($V219*Account!$AB$2)","v":0},{"$f":"SUM($W219*Account!$AA$2)","v":0},0]
[219,null,null,null,null,null,null,null,1,{"$f":"IF(Account!$AJ$2=0,0,SUM(Account!$AJ$2-$D220))","v":0},1,0,0,{"$f":"ROUND(SUM($L220*Account!$AI$2),2)","v":0},{"$f":"ROUND(SUM($M220*Account!$AH$2),2)","v":0},{"$f":"IF(Account!$Z$2=0,0,SUM(Account!$Z$2-$D220))","v":0},1,{"$f":"SUM(SUM(SUM(SUM($N220:$O220)/$I220*$P220)*Account!$Y$2)/100)","v":0},{"$f":"SUM(SUM(SUM(SUM($N220:$O220)/$I220*$Q220)*Account!$X$2)/100)","v":0},{"$f":"IF(Account!$AC$2=0,0,SUM(Account!$AC$2-$D220))","v":0},1,0,0,{"$f":"SUM($V220*Account!$AB$2)","v":0},{"$f":"SUM($W220*Account!$AA$2)","v":0},0]
[220,null,null,null,null,null,null,null,1,{"$f":"IF(Account!$AJ$2=0,0,SUM(Account!$AJ$2-$D221))","v":0},1,0,0,{"$f":"ROUND(SUM($L221*Account!$AI$2),2)","v":0},{"$f":"ROUND(SUM($M221*Account!$AH$2),2)","v":0},{"$f":"IF(Account!$Z$2=0,0,SUM(Account!$Z$2-$D221))","v":0},1,{"$f":"SUM(SUM(SUM(SUM($N221:$O221)/$I221*$P221)*Account!$Y$2)/100)","v":0},{"$f":"SUM(SUM(SUM(SUM($N221:$O221)/$I221*$Q221)*Account!$X$2)/100)","v":0},{"$f":"IF(Account!$AC$2=0,0,SUM(Account!$AC$2-$D221))","v":0},1,0,0,{"$f":"SUM($V221*Account!$AB$2)","v":0},{"$f":"SUM($W221*Account!$AA$2)","v":0},0]
[221,null,null,null,null,null,null,null,1,{"$f":"IF(Account!$AJ$2=0,0,SUM(Account!$AJ$2-$D222))","v":0},1,0,0,{"$f":"ROUND(SUM($L222*Account!$AI$2),2)","v":0},{"$f":"ROUND(SUM($M222*Account!$AH$2),2)","v":0},{"$f":"IF(Account!$Z$2=0,0,SUM(Account!$Z$2-$D222))","v":0},1,{"$f":"SUM(SUM(SUM(SUM($N222:$O222)/$I222*$P222)*Account!$Y$2)/100)","v":0},{"$f":"SUM(SUM(SUM(SUM($N222:$O222)/$I222*$Q222)*Account!$X$2)/100)","v":0},{"$f":"IF(Account!$AC$2=0,0,SUM(Account!$AC$2-$D222))","v":0},1,0,0,{"$f":"SUM($V222*Account!$AB$2)","v":0},{"$f":"SUM($W222*Account!$AA$2)","v":0},0]
[222,null,null,null,null,null,null,null,1,{"$f":"IF(Account!$AJ$2=0,0,SUM(Account!$AJ$2-$D223))","v":0},1,0,0,{"$f":"ROUND(SUM($L223*Account!$AI$2),2)","v":0},{"$f":"ROUND(SUM($M223*Account!$AH$2),2)","v":0},{"$f":"IF(Account!$Z$2=0,0,SUM(Account!$Z$2-$D223))","v":0},1,{"$f":"SUM(SUM(SUM(SUM($N223:$O223)/$I223*$P223)*Account!$Y$2)/100)","v":0},{"$f":"SUM(SUM(SUM(SUM($N223:$O223)/$I223*$Q223)*Account!$X$2)/100)","v":0},{"$f":"IF(Account!$AC$2=0,0,SUM(Account!$AC$2-$D223))","v":0},1,0,0,{"$f":"SUM($V223*Account!$AB$2)","v":0},{"$f":"SUM($W223*Account!$AA$2)","v":0},0]
[223,null,null,null,null,null,null,null,1,{"$f":"IF(Account!$AJ$2=0,0,SUM(Account!$AJ$2-$D224))","v":0},1,0,0,{"$f":"ROUND(SUM($L224*Account!$AI$2),2)","v":0},{"$f":"ROUND(SUM($M224*Account!$AH$2),2)","v":0},{"$f":"IF(Account!$Z$2=0,0,SUM(Account!$Z$2-$D224))","v":0},1,{"$f":"SUM(SUM(SUM(SUM($N224:$O224)/$I224*$P224)*Account!$Y$2)/100)","v":0},{"$f":"SUM(SUM(SUM(SUM($N224:$O224)/$I224*$Q224)*Account!$X$2)/100)","v":0},{"$f":"IF(Account!$AC$2=0,0,SUM(Account!$AC$2-$D224))","v":0},1,0,0,{"$f":"SUM($V224*Account!$AB$2)","v":0},{"$f":"SUM($W224*Account!$AA$2)","v":0},0]
[224,null,null,null,null,null,null,null,1,{"$f":"IF(Account!$AJ$2=0,0,SUM(Account!$AJ$2-$D225))","v":0},1,0,0,{"$f":"ROUND(SUM($L225*Account!$AI$2),2)","v":0},{"$f":"ROUND(SUM($M225*Account!$AH$2),2)","v":0},{"$f":"IF(Account!$Z$2=0,0,SUM(Account!$Z$2-$D225))","v":0},1,{"$f":"SUM(SUM(SUM(SUM($N225:$O225)/$I225*$P225)*Account!$Y$2)/100)","v":0},{"$f":"SUM(SUM(SUM(SUM($N225:$O225)/$I225*$Q225)*Account!$X$2)/100)","v":0},{"$f":"IF(Account!$AC$2=0,0,SUM(Account!$AC$2-$D225))","v":0},1,0,0,{"$f":"SUM($V225*Account!$AB$2)","v":0},{"$f":"SUM($W225*Account!$AA$2)","v":0},0]
[225,null,null,null,null,null,null,null,1,{"$f":"IF(Account!$AJ$2=0,0,SUM(Account!$AJ$2-$D226))","v":0},1,0,0,{"$f":"ROUND(SUM($L226*Account!$AI$2),2)","v":0},{"$f":"ROUND(SUM($M226*Account!$AH$2),2)","v":0},{"$f":"IF(Account!$Z$2=0,0,SUM(Account!$Z$2-$D226))","v":0},1,{"$f":"SUM(SUM(SUM(SUM($N226:$O226)/$I226*$P226)*Account!$Y$2)/100)","v":0},{"$f":"SUM(SUM(SUM(SUM($N226:$O226)/$I226*$Q226)*Account!$X$2)/100)","v":0},{"$f":"IF(Account!$AC$2=0,0,SUM(Account!$AC$2-$D226))","v":0},1,0,0,{"$f":"SUM($V226*Account!$AB$2)","v":0},{"$f":"SUM($W226*Account!$AA$2)","v":0},0]
[226,null,null,null,null,null,null,null,1,{"$f":"IF(Account!$AJ$2=0,0,SUM(Account!$AJ$2-$D227))","v":0},1,0,0,{"$f":"ROUND(SUM($L227*Account!$AI$2),2)","v":0},{"$f":"ROUND(SUM($M227*Account!$AH$2),2)","v":0},{"$f":"IF(Account!$Z$2=0,0,SUM(Account!$Z$2-$D227))","v":0},1,{"$f":"SUM(SUM(SUM(SUM($N227:$O227)/$I227*$P227)*Account!$Y$2)/100)","v":0},{"$f":"SUM(SUM(SUM(SUM($N227:$O227)/$I227*$Q227)*Account!$X$2)/100)","v":0},{"$f":"IF(Account!$AC$2=0,0,SUM(Account!$AC$2-$D227))","v":0},1,0,0,{"$f":"SUM($V227*Account!$AB$2)","v":0},{"$f":"SUM($W227*Account!$AA$2)","v":0},0]
[227,null,null,null,null,null,null,null,1,{"$f":"IF(Account!$AJ$2=0,0,SUM(Account!$AJ$2-$D228))","v":0},1,0,0,{"$f":"ROUND(SUM($L228*Account!$AI$2),2)","v":0},{"$f":"ROUND(SUM($M228*Account!$AH$2),2)","v":0},{"$f":"IF(Account!$Z$2=0,0,SUM(Account!$Z$2-$D228))","v":0},1,{"$f":"SUM(SUM(SUM(SUM($N228:$O228)/$I228*$P228)*Account!$Y$2)/100)","v":0},{"$f":"SUM(SUM(SUM(SUM($N228:$O228)/$I228*$Q228)*Account!$X$2)/100)","v":0},{"$f":"IF(Account!$AC$2=0,0,SUM(Account!$AC$2-$D228))","v":0},1,0,0,{"$f":"SUM($V228*Account!$AB$2)","v":0},{"$f":"SUM($W228*Account!$AA$2)","v":0},0]
[228,null,null,null,null,null,null,null,1,{"$f":"IF(Account!$AJ$2=0,0,SUM(Account!$AJ$2-$D229))","v":0},1,0,0,{"$f":"ROUND(SUM($L229*Account!$AI$2),2)","v":0},{"$f":"ROUND(SUM($M229*Account!$AH$2),2)","v":0},{"$f":"IF(Account!$Z$2=0,0,SUM(Account!$Z$2-$D229))","v":0},1,{"$f":"SUM(SUM(SUM(SUM($N229:$O229)/$I229*$P229)*Account!$Y$2)/100)","v":0},{"$f":"SUM(SUM(SUM(SUM($N229:$O229)/$I229*$Q229)*Account!$X$2)/100)","v":0},{"$f":"IF(Account!$AC$2=0,0,SUM(Account!$AC$2-$D229))","v":0},1,0,0,{"$f":"SUM($V229*Account!$AB$2)","v":0},{"$f":"SUM($W229*Account!$AA$2)","v":0},0]
[229,null,null,null,null,null,null,null,1,{"$f":"IF(Account!$AJ$2=0,0,SUM(Account!$AJ$2-$D230))","v":0},1,0,0,{"$f":"ROUND(SUM($L230*Account!$AI$2),2)","v":0},{"$f":"ROUND(SUM($M230*Account!$AH$2),2)","v":0},{"$f":"IF(Account!$Z$2=0,0,SUM(Account!$Z$2-$D230))","v":0},1,{"$f":"SUM(SUM(SUM(SUM($N230:$O230)/$I230*$P230)*Account!$Y$2)/100)","v":0},{"$f":"SUM(SUM(SUM(SUM($N230:$O230)/$I230*$Q230)*Account!$X$2)/100)","v":0},{"$f":"IF(Account!$AC$2=0,0,SUM(Account!$AC$2-$D230))","v":0},1,0,0,{"$f":"SUM($V230*Account!$AB$2)","v":0},{"$f":"SUM($W230*Account!$AA$2)","v":0},0]
[230,null,null,null,null,null,null,null,1,{"$f":"IF(Account!$AJ$2=0,0,SUM(Account!$AJ$2-$D231))","v":0},1,0,0,{"$f":"ROUND(SUM($L231*Account!$AI$2),2)","v":0},{"$f":"ROUND(SUM($M231*Account!$AH$2),2)","v":0},{"$f":"IF(Account!$Z$2=0,0,SUM(Account!$Z$2-$D231))","v":0},1,{"$f":"SUM(SUM(SUM(SUM($N231:$O231)/$I231*$P231)*Account!$Y$2)/100)","v":0},{"$f":"SUM(SUM(SUM(SUM($N231:$O231)/$I231*$Q231)*Account!$X$2)/100)","v":0},{"$f":"IF(Account!$AC$2=0,0,SUM(Account!$AC$2-$D231))","v":0},1,0,0,{"$f":"SUM($V231*Account!$AB$2)","v":0},{"$f":"SUM($W231*Account!$AA$2)","v":0},0]
[231,null,null,null,null,null,null,null,1,{"$f":"IF(Account!$AJ$2=0,0,SUM(Account!$AJ$2-$D232))","v":0},1,0,0,{"$f":"ROUND(SUM($L232*Account!$AI$2),2)","v":0},{"$f":"ROUND(SUM($M232*Account!$AH$2),2)","v":0},{"$f":"IF(Account!$Z$2=0,0,SUM(Account!$Z$2-$D232))","v":0},1,{"$f":"SUM(SUM(SUM(SUM($N232:$O232)/$I232*$P232)*Account!$Y$2)/100)","v":0},{"$f":"SUM(SUM(SUM(SUM($N232:$O232)/$I232*$Q232)*Account!$X$2)/100)","v":0},{"$f":"IF(Account!$AC$2=0,0,SUM(Account!$AC$2-$D232))","v":0},1,0,0,{"$f":"SUM($V232*Account!$AB$2)","v":0},{"$f":"SUM($W232*Account!$AA$2)","v":0},0]
[232,null,null,null,null,null,null,null,1,{"$f":"IF(Account!$AJ$2=0,0,SUM(Account!$AJ$2-$D233))","v":0},1,0,0,{"$f":"ROUND(SUM($L233*Account!$AI$2),2)","v":0},{"$f":"ROUND(SUM($M233*Account!$AH$2),2)","v":0},{"$f":"IF(Account!$Z$2=0,0,SUM(Account!$Z$2-$D233))","v":0},1,{"$f":"SUM(SUM(SUM(SUM($N233:$O233)/$I233*$P233)*Account!$Y$2)/100)","v":0},{"$f":"SUM(SUM(SUM(SUM($N233:$O233)/$I233*$Q233)*Account!$X$2)/100)","v":0},{"$f":"IF(Account!$AC$2=0,0,SUM(Account!$AC$2-$D233))","v":0},1,0,0,{"$f":"SUM($V233*Account!$AB$2)","v":0},{"$f":"SUM($W233*Account!$AA$2)","v":0},0]
[233,null,null,null,null,null,null,null,1,{"$f":"IF(Account!$AJ$2=0,0,SUM(Account!$AJ$2-$D234))","v":0},1,0,0,{"$f":"ROUND(SUM($L234*Account!$AI$2),2)","v":0},{"$f":"ROUND(SUM($M234*Account!$AH$2),2)","v":0},{"$f":"IF(Account!$Z$2=0,0,SUM(Account!$Z$2-$D234))","v":0},1,{"$f":"SUM(SUM(SUM(SUM($N234:$O234)/$I234*$P234)*Account!$Y$2)/100)","v":0},{"$f":"SUM(SUM(SUM(SUM($N234:$O234)/$I234*$Q234)*Account!$X$2)/100)","v":0},{"$f":"IF(Account!$AC$2=0,0,SUM(Account!$AC$2-$D234))","v":0},1,0,0,{"$f":"SUM($V234*Account!$AB$2)","v":0},{"$f":"SUM($W234*Account!$AA$2)","v":0},0]
[234,null,null,null,null,null,null,null,1,{"$f":"IF(Account!$AJ$2=0,0,SUM(Account!$AJ$2-$D235))","v":0},1,0,0,{"$f":"ROUND(SUM($L235*Account!$AI$2),2)","v":0},{"$f":"ROUND(SUM($M235*Account!$AH$2),2)","v":0},{"$f":"IF(Account!$Z$2=0,0,SUM(Account!$Z$2-$D235))","v":0},1,{"$f":"SUM(SUM(SUM(SUM($N235:$O235)/$I235*$P235)*Account!$Y$2)/100)","v":0},{"$f":"SUM(SUM(SUM(SUM($N235:$O235)/$I235*$Q235)*Account!$X$2)/100)","v":0},{"$f":"IF(Account!$AC$2=0,0,SUM(Account!$AC$2-$D235))","v":0},1,0,0,{"$f":"SUM($V235*Account!$AB$2)","v":0},{"$f":"SUM($W235*Account!$AA$2)","v":0},0]
[235,null,null,null,null,null,null,null,1,{"$f":"IF(Account!$AJ$2=0,0,SUM(Account!$AJ$2-$D236))","v":0},1,0,0,{"$f":"ROUND(SUM($L236*Account!$AI$2),2)","v":0},{"$f":"ROUND(SUM($M236*Account!$AH$2),2)","v":0},{"$f":"IF(Account!$Z$2=0,0,SUM(Account!$Z$2-$D236))","v":0},1,{"$f":"SUM(SUM(SUM(SUM($N236:$O236)/$I236*$P236)*Account!$Y$2)/100)","v":0},{"$f":"SUM(SUM(SUM(SUM($N236:$O236)/$I236*$Q236)*Account!$X$2)/100)","v":0},{"$f":"IF(Account!$AC$2=0,0,SUM(Account!$AC$2-$D236))","v":0},1,0,0,{"$f":"SUM($V236*Account!$AB$2)","v":0},{"$f":"SUM($W236*Account!$AA$2)","v":0},0]
[236,null,null,null,null,null,null,null,1,{"$f":"IF(Account!$AJ$2=0,0,SUM(Account!$AJ$2-$D237))","v":0},1,0,0,{"$f":"ROUND(SUM($L237*Account!$AI$2),2)","v":0},{"$f":"ROUND(SUM($M237*Account!$AH$2),2)","v":0},{"$f":"IF(Account!$Z$2=0,0,SUM(Account!$Z$2-$D237))","v":0},1,{"$f":"SUM(SUM(SUM(SUM($N237:$O237)/$I237*$P237)*Account!$Y$2)/100)","v":0},{"$f":"SUM(SUM(SUM(SUM($N237:$O237)/$I237*$Q237)*Account!$X$2)/100)","v":0},{"$f":"IF(Account!$AC$2=0,0,SUM(Account!$AC$2-$D237))","v":0},1,0,0,{"$f":"SUM($V237*Account!$AB$2)","v":0},{"$f":"SUM($W237*Account!$AA$2)","v":0},0]
[237,null,null,null,null,null,null,null,1,{"$f":"IF(Account!$AJ$2=0,0,SUM(Account!$AJ$2-$D238))","v":0},1,0,0,{"$f":"ROUND(SUM($L238*Account!$AI$2),2)","v":0},{"$f":"ROUND(SUM($M238*Account!$AH$2),2)","v":0},{"$f":"IF(Account!$Z$2=0,0,SUM(Account!$Z$2-$D238))","v":0},1,{"$f":"SUM(SUM(SUM(SUM($N238:$O238)/$I238*$P238)*Account!$Y$2)/100)","v":0},{"$f":"SUM(SUM(SUM(SUM($N238:$O238)/$I238*$Q238)*Account!$X$2)/100)","v":0},{"$f":"IF(Account!$AC$2=0,0,SUM(Account!$AC$2-$D238))","v":0},1,0,0,{"$f":"SUM($V238*Account!$AB$2)","v":0},{"$f":"SUM($W238*Account!$AA$2)","v":0},0]
[238,null,null,null,null,null,null,null,1,{"$f":"IF(Account!$AJ$2=0,0,SUM(Account!$AJ$2-$D239))","v":0},1,0,0,{"$f":"ROUND(SUM($L239*Account!$AI$2),2)","v":0},{"$f":"ROUND(SUM($M239*Account!$AH$2),2)","v":0},{"$f":"IF(Account!$Z$2=0,0,SUM(Account!$Z$2-$D239))","v":0},1,{"$f":"SUM(SUM(SUM(SUM($N239:$O239)/$I239*$P239)*Account!$Y$2)/100)","v":0},{"$f":"SUM(SUM(SUM(SUM($N239:$O239)/$I239*$Q239)*Account!$X$2)/100)","v":0},{"$f":"IF(Account!$AC$2=0,0,SUM(Account!$AC$2-$D239))","v":0},1,0,0,{"$f":"SUM($V239*Account!$AB$2)","v":0},{"$f":"SUM($W239*Account!$AA$2)","v":0},0]
[239,null,null,null,null,null,null,null,1,{"$f":"IF(Account!$AJ$2=0,0,SUM(Account!$AJ$2-$D240))","v":0},1,0,0,{"$f":"ROUND(SUM($L240*Account!$AI$2),2)","v":0},{"$f":"ROUND(SUM($M240*Account!$AH$2),2)","v":0},{"$f":"IF(Account!$Z$2=0,0,SUM(Account!$Z$2-$D240))","v":0},1,{"$f":"SUM(SUM(SUM(SUM($N240:$O240)/$I240*$P240)*Account!$Y$2)/100)","v":0},{"$f":"SUM(SUM(SUM(SUM($N240:$O240)/$I240*$Q240)*Account!$X$2)/100)","v":0},{"$f":"IF(Account!$AC$2=0,0,SUM(Account!$AC$2-$D240))","v":0},1,0,0,{"$f":"SUM($V240*Account!$AB$2)","v":0},{"$f":"SUM($W240*Account!$AA$2)","v":0},0]
[240,null,null,null,null,null,null,null,1,{"$f":"IF(Account!$AJ$2=0,0,SUM(Account!$AJ$2-$D241))","v":0},1,0,0,{"$f":"ROUND(SUM($L241*Account!$AI$2),2)","v":0},{"$f":"ROUND(SUM($M241*Account!$AH$2),2)","v":0},{"$f":"IF(Account!$Z$2=0,0,SUM(Account!$Z$2-$D241))","v":0},1,{"$f":"SUM(SUM(SUM(SUM($N241:$O241)/$I241*$P241)*Account!$Y$2)/100)","v":0},{"$f":"SUM(SUM(SUM(SUM($N241:$O241)/$I241*$Q241)*Account!$X$2)/100)","v":0},{"$f":"IF(Account!$AC$2=0,0,SUM(Account!$AC$2-$D241))","v":0},1,0,0,{"$f":"SUM($V241*Account!$AB$2)","v":0},{"$f":"SUM($W241*Account!$AA$2)","v":0},0]
[241,null,null,null,null,null,null,null,1,{"$f":"IF(Account!$AJ$2=0,0,SUM(Account!$AJ$2-$D242))","v":0},1,0,0,{"$f":"ROUND(SUM($L242*Account!$AI$2),2)","v":0},{"$f":"ROUND(SUM($M242*Account!$AH$2),2)","v":0},{"$f":"IF(Account!$Z$2=0,0,SUM(Account!$Z$2-$D242))","v":0},1,{"$f":"SUM(SUM(SUM(SUM($N242:$O242)/$I242*$P242)*Account!$Y$2)/100)","v":0},{"$f":"SUM(SUM(SUM(SUM($N242:$O242)/$I242*$Q242)*Account!$X$2)/100)","v":0},{"$f":"IF(Account!$AC$2=0,0,SUM(Account!$AC$2-$D242))","v":0},1,0,0,{"$f":"SUM($V242*Account!$AB$2)","v":0},{"$f":"SUM($W242*Account!$AA$2)","v":0},0]
[242,null,null,null,null,null,null,null,1,{"$f":"IF(Account!$AJ$2=0,0,SUM(Account!$AJ$2-$D243))","v":0},1,0,0,{"$f":"ROUND(SUM($L243*Account!$AI$2),2)","v":0},{"$f":"ROUND(SUM($M243*Account!$AH$2),2)","v":0},{"$f":"IF(Account!$Z$2=0,0,SUM(Account!$Z$2-$D243))","v":0},1,{"$f":"SUM(SUM(SUM(SUM($N243:$O243)/$I243*$P243)*Account!$Y$2)/100)","v":0},{"$f":"SUM(SUM(SUM(SUM($N243:$O243)/$I243*$Q243)*Account!$X$2)/100)","v":0},{"$f":"IF(Account!$AC$2=0,0,SUM(Account!$AC$2-$D243))","v":0},1,0,0,{"$f":"SUM($V243*Account!$AB$2)","v":0},{"$f":"SUM($W243*Account!$AA$2)","v":0},0]
[243,null,null,null,null,null,null,null,1,{"$f":"IF(Account!$AJ$2=0,0,SUM(Account!$AJ$2-$D244))","v":0},1,0,0,{"$f":"ROUND(SUM($L244*Account!$AI$2),2)","v":0},{"$f":"ROUND(SUM($M244*Account!$AH$2),2)","v":0},{"$f":"IF(Account!$Z$2=0,0,SUM(Account!$Z$2-$D244))","v":0},1,{"$f":"SUM(SUM(SUM(SUM($N244:$O244)/$I244*$P244)*Account!$Y$2)/100)","v":0},{"$f":"SUM(SUM(SUM(SUM($N244:$O244)/$I244*$Q244)*Account!$X$2)/100)","v":0},{"$f":"IF(Account!$AC$2=0,0,SUM(Account!$AC$2-$D244))","v":0},1,0,0,{"$f":"SUM($V244*Account!$AB$2)","v":0},{"$f":"SUM($W244*Account!$AA$2)","v":0},0]
[244,null,null,null,null,null,null,null,1,{"$f":"IF(Account!$AJ$2=0,0,SUM(Account!$AJ$2-$D245))","v":0},1,0,0,{"$f":"ROUND(SUM($L245*Account!$AI$2),2)","v":0},{"$f":"ROUND(SUM($M245*Account!$AH$2),2)","v":0},{"$f":"IF(Account!$Z$2=0,0,SUM(Account!$Z$2-$D245))","v":0},1,{"$f":"SUM(SUM(SUM(SUM($N245:$O245)/$I245*$P245)*Account!$Y$2)/100)","v":0},{"$f":"SUM(SUM(SUM(SUM($N245:$O245)/$I245*$Q245)*Account!$X$2)/100)","v":0},{"$f":"IF(Account!$AC$2=0,0,SUM(Account!$AC$2-$D245))","v":0},1,0,0,{"$f":"SUM($V245*Account!$AB$2)","v":0},{"$f":"SUM($W245*Account!$AA$2)","v":0},0]
[245,null,null,null,null,null,null,null,1,{"$f":"IF(Account!$AJ$2=0,0,SUM(Account!$AJ$2-$D246))","v":0},1,0,0,{"$f":"ROUND(SUM($L246*Account!$AI$2),2)","v":0},{"$f":"ROUND(SUM($M246*Account!$AH$2),2)","v":0},{"$f":"IF(Account!$Z$2=0,0,SUM(Account!$Z$2-$D246))","v":0},1,{"$f":"SUM(SUM(SUM(SUM($N246:$O246)/$I246*$P246)*Account!$Y$2)/100)","v":0},{"$f":"SUM(SUM(SUM(SUM($N246:$O246)/$I246*$Q246)*Account!$X$2)/100)","v":0},{"$f":"IF(Account!$AC$2=0,0,SUM(Account!$AC$2-$D246))","v":0},1,0,0,{"$f":"SUM($V246*Account!$AB$2)","v":0},{"$f":"SUM($W246*Account!$AA$2)","v":0},0]
[246,null,null,null,null,null,null,null,1,{"$f":"IF(Account!$AJ$2=0,0,SUM(Account!$AJ$2-$D247))","v":0},1,0,0,{"$f":"ROUND(SUM($L247*Account!$AI$2),2)","v":0},{"$f":"ROUND(SUM($M247*Account!$AH$2),2)","v":0},{"$f":"IF(Account!$Z$2=0,0,SUM(Account!$Z$2-$D247))","v":0},1,{"$f":"SUM(SUM(SUM(SUM($N247:$O247)/$I247*$P247)*Account!$Y$2)/100)","v":0},{"$f":"SUM(SUM(SUM(SUM($N247:$O247)/$I247*$Q247)*Account!$X$2)/100)","v":0},{"$f":"IF(Account!$AC$2=0,0,SUM(Account!$AC$2-$D247))","v":0},1,0,0,{"$f":"SUM($V247*Account!$AB$2)","v":0},{"$f":"SUM($W247*Account!$AA$2)","v":0},0]
[247,null,null,null,null,null,null,null,1,{"$f":"IF(Account!$AJ$2=0,0,SUM(Account!$AJ$2-$D248))","v":0},1,0,0,{"$f":"ROUND(SUM($L248*Account!$AI$2),2)","v":0},{"$f":"ROUND(SUM($M248*Account!$AH$2),2)","v":0},{"$f":"IF(Account!$Z$2=0,0,SUM(Account!$Z$2-$D248))","v":0},1,{"$f":"SUM(SUM(SUM(SUM($N248:$O248)/$I248*$P248)*Account!$Y$2)/100)","v":0},{"$f":"SUM(SUM(SUM(SUM($N248:$O248)/$I248*$Q248)*Account!$X$2)/100)","v":0},{"$f":"IF(Account!$AC$2=0,0,SUM(Account!$AC$2-$D248))","v":0},1,0,0,{"$f":"SUM($V248*Account!$AB$2)","v":0},{"$f":"SUM($W248*Account!$AA$2)","v":0},0]
[248,null,null,null,null,null,null,null,1,{"$f":"IF(Account!$AJ$2=0,0,SUM(Account!$AJ$2-$D249))","v":0},1,0,0,{"$f":"ROUND(SUM($L249*Account!$AI$2),2)","v":0},{"$f":"ROUND(SUM($M249*Account!$AH$2),2)","v":0},{"$f":"IF(Account!$Z$2=0,0,SUM(Account!$Z$2-$D249))","v":0},1,{"$f":"SUM(SUM(SUM(SUM($N249:$O249)/$I249*$P249)*Account!$Y$2)/100)","v":0},{"$f":"SUM(SUM(SUM(SUM($N249:$O249)/$I249*$Q249)*Account!$X$2)/100)","v":0},{"$f":"IF(Account!$AC$2=0,0,SUM(Account!$AC$2-$D249))","v":0},1,0,0,{"$f":"SUM($V249*Account!$AB$2)","v":0},{"$f":"SUM($W249*Account!$AA$2)","v":0},0]
[249,null,null,null,null,null,null,null,1,{"$f":"IF(Account!$AJ$2=0,0,SUM(Account!$AJ$2-$D250))","v":0},1,0,0,{"$f":"ROUND(SUM($L250*Account!$AI$2),2)","v":0},{"$f":"ROUND(SUM($M250*Account!$AH$2),2)","v":0},{"$f":"IF(Account!$Z$2=0,0,SUM(Account!$Z$2-$D250))","v":0},1,{"$f":"SUM(SUM(SUM(SUM($N250:$O250)/$I250*$P250)*Account!$Y$2)/100)","v":0},{"$f":"SUM(SUM(SUM(SUM($N250:$O250)/$I250*$Q250)*Account!$X$2)/100)","v":0},{"$f":"IF(Account!$AC$2=0,0,SUM(Account!$AC$2-$D250))","v":0},1,0,0,{"$f":"SUM($V250*Account!$AB$2)","v":0},{"$f":"SUM($W250*Account!$AA$2)","v":0},0]
[250,null,null,null,null,null,null,null,1,{"$f":"IF(Account!$AJ$2=0,0,SUM(Account!$AJ$2-$D251))","v":0},1,0,0,{"$f":"ROUND(SUM($L251*Account!$AI$2),2)","v":0},{"$f":"ROUND(SUM($M251*Account!$AH$2),2)","v":0},{"$f":"IF(Account!$Z$2=0,0,SUM(Account!$Z$2-$D251))","v":0},1,{"$f":"SUM(SUM(SUM(SUM($N251:$O251)/$I251*$P251)*Account!$Y$2)/100)","v":0},{"$f":"SUM(SUM(SUM(SUM($N251:$O251)/$I251*$Q251)*Account!$X$2)/100)","v":0},{"$f":"IF(Account!$AC$2=0,0,SUM(Account!$AC$2-$D251))","v":0},1,0,0,{"$f":"SUM($V251*Account!$AB$2)","v":0},{"$f":"SUM($W251*Account!$AA$2)","v":0},0]
[251,null,null,null,null,null,null,null,1,{"$f":"IF(Account!$AJ$2=0,0,SUM(Account!$AJ$2-$D252))","v":0},1,0,0,{"$f":"ROUND(SUM($L252*Account!$AI$2),2)","v":0},{"$f":"ROUND(SUM($M252*Account!$AH$2),2)","v":0},{"$f":"IF(Account!$Z$2=0,0,SUM(Account!$Z$2-$D252))","v":0},1,{"$f":"SUM(SUM(SUM(SUM($N252:$O252)/$I252*$P252)*Account!$Y$2)/100)","v":0},{"$f":"SUM(SUM(SUM(SUM($N252:$O252)/$I252*$Q252)*Account!$X$2)/100)","v":0},{"$f":"IF(Account!$AC$2=0,0,SUM(Account!$AC$2-$D252))","v":0},1,0,0,{"$f":"SUM($V252*Account!$AB$2)","v":0},{"$f":"SUM($W252*Account!$AA$2)","v":0},0]
[252,null,null,null,null,null,null,null,1,{"$f":"IF(Account!$AJ$2=0,0,SUM(Account!$AJ$2-$D253))","v":0},1,0,0,{"$f":"ROUND(SUM($L253*Account!$AI$2),2)","v":0},{"$f":"ROUND(SUM($M253*Account!$AH$2),2)","v":0},{"$f":"IF(Account!$Z$2=0,0,SUM(Account!$Z$2-$D253))","v":0},1,{"$f":"SUM(SUM(SUM(SUM($N253:$O253)/$I253*$P253)*Account!$Y$2)/100)","v":0},{"$f":"SUM(SUM(SUM(SUM($N253:$O253)/$I253*$Q253)*Account!$X$2)/100)","v":0},{"$f":"IF(Account!$AC$2=0,0,SUM(Account!$AC$2-$D253))","v":0},1,0,0,{"$f":"SUM($V253*Account!$AB$2)","v":0},{"$f":"SUM($W253*Account!$AA$2)","v":0},0]
[253,null,null,null,null,null,null,null,1,{"$f":"IF(Account!$AJ$2=0,0,SUM(Account!$AJ$2-$D254))","v":0},1,0,0,{"$f":"ROUND(SUM($L254*Account!$AI$2),2)","v":0},{"$f":"ROUND(SUM($M254*Account!$AH$2),2)","v":0},{"$f":"IF(Account!$Z$2=0,0,SUM(Account!$Z$2-$D254))","v":0},1,{"$f":"SUM(SUM(SUM(SUM($N254:$O254)/$I254*$P254)*Account!$Y$2)/100)","v":0},{"$f":"SUM(SUM(SUM(SUM($N254:$O254)/$I254*$Q254)*Account!$X$2)/100)","v":0},{"$f":"IF(Account!$AC$2=0,0,SUM(Account!$AC$2-$D254))","v":0},1,0,0,{"$f":"SUM($V254*Account!$AB$2)","v":0},{"$f":"SUM($W254*Account!$AA$2)","v":0},0]
[254,null,null,null,null,null,null,null,1,{"$f":"IF(Account!$AJ$2=0,0,SUM(Account!$AJ$2-$D255))","v":0},1,0,0,{"$f":"ROUND(SUM($L255*Account!$AI$2),2)","v":0},{"$f":"ROUND(SUM($M255*Account!$AH$2),2)","v":0},{"$f":"IF(Account!$Z$2=0,0,SUM(Account!$Z$2-$D255))","v":0},1,{"$f":"SUM(SUM(SUM(SUM($N255:$O255)/$I255*$P255)*Account!$Y$2)/100)","v":0},{"$f":"SUM(SUM(SUM(SUM($N255:$O255)/$I255*$Q255)*Account!$X$2)/100)","v":0},{"$f":"IF(Account!$AC$2=0,0,SUM(Account!$AC$2-$D255))","v":0},1,0,0,{"$f":"SUM($V255*Account!$AB$2)","v":0},{"$f":"SUM($W255*Account!$AA$2)","v":0},0]
[255,null,null,null,null,null,null,null,1,{"$f":"IF(Account!$AJ$2=0,0,SUM(Account!$AJ$2-$D256))","v":0},1,0,0,{"$f":"ROUND(SUM($L256*Account!$AI$2),2)","v":0},{"$f":"ROUND(SUM($M256*Account!$AH$2),2)","v":0},{"$f":"IF(Account!$Z$2=0,0,SUM(Account!$Z$2-$D256))","v":0},1,{"$f":"SUM(SUM(SUM(SUM($N256:$O256)/$I256*$P256)*Account!$Y$2)/100)","v":0},{"$f":"SUM(SUM(SUM(SUM($N256:$O256)/$I256*$Q256)*Account!$X$2)/100)","v":0},{"$f":"IF(Account!$AC$2=0,0,SUM(Account!$AC$2-$D256))","v":0},1,0,0,{"$f":"SUM($V256*Account!$AB$2)","v":0},{"$f":"SUM($W256*Account!$AA$2)","v":0},0]
[256,null,null,null,null,null,null,null,1,{"$f":"IF(Account!$AJ$2=0,0,SUM(Account!$AJ$2-$D257))","v":0},1,0,0,{"$f":"ROUND(SUM($L257*Account!$AI$2),2)","v":0},{"$f":"ROUND(SUM($M257*Account!$AH$2),2)","v":0},{"$f":"IF(Account!$Z$2=0,0,SUM(Account!$Z$2-$D257))","v":0},1,{"$f":"SUM(SUM(SUM(SUM($N257:$O257)/$I257*$P257)*Account!$Y$2)/100)","v":0},{"$f":"SUM(SUM(SUM(SUM($N257:$O257)/$I257*$Q257)*Account!$X$2)/100)","v":0},{"$f":"IF(Account!$AC$2=0,0,SUM(Account!$AC$2-$D257))","v":0},1,0,0,{"$f":"SUM($V257*Account!$AB$2)","v":0},{"$f":"SUM($W257*Account!$AA$2)","v":0},0]
[257,null,null,null,null,null,null,null,1,{"$f":"IF(Account!$AJ$2=0,0,SUM(Account!$AJ$2-$D258))","v":0},{"$f":"SUM($I258-$J258)","v":1},0,0,{"$f":"ROUND(SUM($L258*Account!$AI$2),2)","v":0},{"$f":"ROUND(SUM($M258*Account!$AH$2),2)","v":0},{"$f":"IF(Account!$Z$2=0,0,SUM(Account!$Z$2-$D258))","v":0},{"$f":"SUM($I258-$P258)","v":1},{"$f":"SUM(SUM(SUM(SUM($N258:$O258)/$I258*$P258)*Account!$Y$2)/100)","v":0},{"$f":"SUM(SUM(SUM(SUM($N258:$O258)/$I258*$Q258)*Account!$X$2)/100)","v":0},{"$f":"IF(Account!$AC$2=0,0,SUM(Account!$AC$2-$D258))","v":0},{"$f":"SUM($I258-$T258)","v":1},0,0,{"$f":"SUM($V258*Account!$AB$2)","v":0},{"$f":"SUM($W258*Account!$AA$2)","v":0},0]
[258,null,null,null,null,null,null,null,{"$f":"SUM($E259-$D259+1)","v":1},{"$f":"IF(Account!$AJ$2=0,0,SUM(Account!$AJ$2-$D259))","v":0},1,{"$f":"ROUND(IF($J259=0,0,SUM($H259/$I259*$K259)),2)","v":0},{"$f":"ROUND(SUM($H259-$L259),2)","v":0},{"$f":"ROUND(SUM($L259*Account!$AI$2),2)","v":0},{"$f":"ROUND(SUM($M259*Account!$AH$2),2)","v":0},{"$f":"IF(Account!$Z$2=0,0,SUM(Account!$Z$2-$D259))","v":0},1,{"$f":"SUM(SUM(SUM(SUM($N259:$O259)/$I259*$P259)*Account!$Y$2)/100)","v":0},{"$f":"SUM(SUM(SUM(SUM($N259:$O259)/$I259*$Q259)*Account!$X$2)/100)","v":0},{"$f":"IF(Account!$AC$2=0,0,SUM(Account!$AC$2-$D259))","v":0},1,{"$f":"ROUND(IF($T259=0,0,SUM($H259/$I259*$T259)),2)","v":0},{"$f":"ROUND(SUM($H259-$V259),2)","v":0},{"$f":"SUM($V259*Account!$AB$2)","v":0},{"$f":"SUM($W259*Account!$AA$2)","v":0},{"$f":"SUM($N259:$O259,$R259:$S259,$X259:$Y259)","v":0}]
[259,null,null,null,null,null,null,null,1,{"$f":"IF(Account!$AJ$2=0,0,SUM(Account!$AJ$2-$D260))","v":0},1,0,0,{"$f":"ROUND(SUM($L260*Account!$AI$2),2)","v":0},{"$f":"ROUND(SUM($M260*Account!$AH$2),2)","v":0},{"$f":"IF(Account!$Z$2=0,0,SUM(Account!$Z$2-$D260))","v":0},1,{"$f":"SUM(SUM(SUM(SUM($N260:$O260)/$I260*$P260)*Account!$Y$2)/100)","v":0},{"$f":"SUM(SUM(SUM(SUM($N260:$O260)/$I260*$Q260)*Account!$X$2)/100)","v":0},{"$f":"IF(Account!$AC$2=0,0,SUM(Account!$AC$2-$D260))","v":0},1,0,0,{"$f":"SUM($V260*Account!$AB$2)","v":0},{"$f":"SUM($W260*Account!$AA$2)","v":0},0]
[260,null,null,null,null,null,null,null,1,{"$f":"IF(Account!$AJ$2=0,0,SUM(Account!$AJ$2-$D261))","v":0},1,0,0,{"$f":"ROUND(SUM($L261*Account!$AI$2),2)","v":0},{"$f":"ROUND(SUM($M261*Account!$AH$2),2)","v":0},{"$f":"IF(Account!$Z$2=0,0,SUM(Account!$Z$2-$D261))","v":0},1,{"$f":"SUM(SUM(SUM(SUM($N261:$O261)/$I261*$P261)*Account!$Y$2)/100)","v":0},{"$f":"SUM(SUM(SUM(SUM($N261:$O261)/$I261*$Q261)*Account!$X$2)/100)","v":0},{"$f":"IF(Account!$AC$2=0,0,SUM(Account!$AC$2-$D261))","v":0},1,0,0,{"$f":"SUM($V261*Account!$AB$2)","v":0},{"$f":"SUM($W261*Account!$AA$2)","v":0},0]
[261,null,null,null,null,null,null,null,1,{"$f":"IF(Account!$AJ$2=0,0,SUM(Account!$AJ$2-$D262))","v":0},1,0,0,{"$f":"ROUND(SUM($L262*Account!$AI$2),2)","v":0},{"$f":"ROUND(SUM($M262*Account!$AH$2),2)","v":0},{"$f":"IF(Account!$Z$2=0,0,SUM(Account!$Z$2-$D262))","v":0},1,{"$f":"SUM(SUM(SUM(SUM($N262:$O262)/$I262*$P262)*Account!$Y$2)/100)","v":0},{"$f":"SUM(SUM(SUM(SUM($N262:$O262)/$I262*$Q262)*Account!$X$2)/100)","v":0},{"$f":"IF(Account!$AC$2=0,0,SUM(Account!$AC$2-$D262))","v":0},1,0,0,{"$f":"SUM($V262*Account!$AB$2)","v":0},{"$f":"SUM($W262*Account!$AA$2)","v":0},0]
[262,null,null,null,null,null,null,null,1,{"$f":"IF(Account!$AJ$2=0,0,SUM(Account!$AJ$2-$D263))","v":0},1,0,0,{"$f":"ROUND(SUM($L263*Account!$AI$2),2)","v":0},{"$f":"ROUND(SUM($M263*Account!$AH$2),2)","v":0},{"$f":"IF(Account!$Z$2=0,0,SUM(Account!$Z$2-$D263))","v":0},1,{"$f":"SUM(SUM(SUM(SUM($N263:$O263)/$I263*$P263)*Account!$Y$2)/100)","v":0},{"$f":"SUM(SUM(SUM(SUM($N263:$O263)/$I263*$Q263)*Account!$X$2)/100)","v":0},{"$f":"IF(Account!$AC$2=0,0,SUM(Account!$AC$2-$D263))","v":0},1,0,0,{"$f":"SUM($V263*Account!$AB$2)","v":0},{"$f":"SUM($W263*Account!$AA$2)","v":0},0]
[263,null,null,null,null,null,null,null,1,{"$f":"IF(Account!$AJ$2=0,0,SUM(Account!$AJ$2-$D264))","v":0},1,0,0,{"$f":"ROUND(SUM($L264*Account!$AI$2),2)","v":0},{"$f":"ROUND(SUM($M264*Account!$AH$2),2)","v":0},{"$f":"IF(Account!$Z$2=0,0,SUM(Account!$Z$2-$D264))","v":0},1,{"$f":"SUM(SUM(SUM(SUM($N264:$O264)/$I264*$P264)*Account!$Y$2)/100)","v":0},{"$f":"SUM(SUM(SUM(SUM($N264:$O264)/$I264*$Q264)*Account!$X$2)/100)","v":0},{"$f":"IF(Account!$AC$2=0,0,SUM(Account!$AC$2-$D264))","v":0},1,0,0,{"$f":"SUM($V264*Account!$AB$2)","v":0},{"$f":"SUM($W264*Account!$AA$2)","v":0},0]
[264,null,null,null,null,null,null,null,1,{"$f":"IF(Account!$AJ$2=0,0,SUM(Account!$AJ$2-$D265))","v":0},1,0,0,{"$f":"ROUND(SUM($L265*Account!$AI$2),2)","v":0},{"$f":"ROUND(SUM($M265*Account!$AH$2),2)","v":0},{"$f":"IF(Account!$Z$2=0,0,SUM(Account!$Z$2-$D265))","v":0},1,{"$f":"SUM(SUM(SUM(SUM($N265:$O265)/$I265*$P265)*Account!$Y$2)/100)","v":0},{"$f":"SUM(SUM(SUM(SUM($N265:$O265)/$I265*$Q265)*Account!$X$2)/100)","v":0},{"$f":"IF(Account!$AC$2=0,0,SUM(Account!$AC$2-$D265))","v":0},1,0,0,{"$f":"SUM($V265*Account!$AB$2)","v":0},{"$f":"SUM($W265*Account!$AA$2)","v":0},0]
[265,null,null,null,null,null,null,null,1,{"$f":"IF(Account!$AJ$2=0,0,SUM(Account!$AJ$2-$D266))","v":0},1,0,0,{"$f":"ROUND(SUM($L266*Account!$AI$2),2)","v":0},{"$f":"ROUND(SUM($M266*Account!$AH$2),2)","v":0},{"$f":"IF(Account!$Z$2=0,0,SUM(Account!$Z$2-$D266))","v":0},1,{"$f":"SUM(SUM(SUM(SUM($N266:$O266)/$I266*$P266)*Account!$Y$2)/100)","v":0},{"$f":"SUM(SUM(SUM(SUM($N266:$O266)/$I266*$Q266)*Account!$X$2)/100)","v":0},{"$f":"IF(Account!$AC$2=0,0,SUM(Account!$AC$2-$D266))","v":0},1,0,0,{"$f":"SUM($V266*Account!$AB$2)","v":0},{"$f":"SUM($W266*Account!$AA$2)","v":0},0]
[266,null,null,null,null,null,null,null,1,{"$f":"IF(Account!$AJ$2=0,0,SUM(Account!$AJ$2-$D267))","v":0},1,0,0,{"$f":"ROUND(SUM($L267*Account!$AI$2),2)","v":0},{"$f":"ROUND(SUM($M267*Account!$AH$2),2)","v":0},{"$f":"IF(Account!$Z$2=0,0,SUM(Account!$Z$2-$D267))","v":0},1,{"$f":"SUM(SUM(SUM(SUM($N267:$O267)/$I267*$P267)*Account!$Y$2)/100)","v":0},{"$f":"SUM(SUM(SUM(SUM($N267:$O267)/$I267*$Q267)*Account!$X$2)/100)","v":0},{"$f":"IF(Account!$AC$2=0,0,SUM(Account!$AC$2-$D267))","v":0},1,0,0,{"$f":"SUM($V267*Account!$AB$2)","v":0},{"$f":"SUM($W267*Account!$AA$2)","v":0},0]
[267,null,null,null,null,null,null,null,1,{"$f":"IF(Account!$AJ$2=0,0,SUM(Account!$AJ$2-$D268))","v":0},1,0,0,{"$f":"ROUND(SUM($L268*Account!$AI$2),2)","v":0},{"$f":"ROUND(SUM($M268*Account!$AH$2),2)","v":0},{"$f":"IF(Account!$Z$2=0,0,SUM(Account!$Z$2-$D268))","v":0},1,{"$f":"SUM(SUM(SUM(SUM($N268:$O268)/$I268*$P268)*Account!$Y$2)/100)","v":0},{"$f":"SUM(SUM(SUM(SUM($N268:$O268)/$I268*$Q268)*Account!$X$2)/100)","v":0},{"$f":"IF(Account!$AC$2=0,0,SUM(Account!$AC$2-$D268))","v":0},1,0,0,{"$f":"SUM($V268*Account!$AB$2)","v":0},{"$f":"SUM($W268*Account!$AA$2)","v":0},0]
[268,null,null,null,null,null,null,null,1,{"$f":"IF(Account!$AJ$2=0,0,SUM(Account!$AJ$2-$D269))","v":0},1,0,0,{"$f":"ROUND(SUM($L269*Account!$AI$2),2)","v":0},{"$f":"ROUND(SUM($M269*Account!$AH$2),2)","v":0},{"$f":"IF(Account!$Z$2=0,0,SUM(Account!$Z$2-$D269))","v":0},1,{"$f":"SUM(SUM(SUM(SUM($N269:$O269)/$I269*$P269)*Account!$Y$2)/100)","v":0},{"$f":"SUM(SUM(SUM(SUM($N269:$O269)/$I269*$Q269)*Account!$X$2)/100)","v":0},{"$f":"IF(Account!$AC$2=0,0,SUM(Account!$AC$2-$D269))","v":0},1,0,0,{"$f":"SUM($V269*Account!$AB$2)","v":0},{"$f":"SUM($W269*Account!$AA$2)","v":0},0]
[269,null,null,null,null,null,null,null,1,{"$f":"IF(Account!$AJ$2=0,0,SUM(Account!$AJ$2-$D270))","v":0},1,0,0,{"$f":"ROUND(SUM($L270*Account!$AI$2),2)","v":0},{"$f":"ROUND(SUM($M270*Account!$AH$2),2)","v":0},{"$f":"IF(Account!$Z$2=0,0,SUM(Account!$Z$2-$D270))","v":0},1,{"$f":"SUM(SUM(SUM(SUM($N270:$O270)/$I270*$P270)*Account!$Y$2)/100)","v":0},{"$f":"SUM(SUM(SUM(SUM($N270:$O270)/$I270*$Q270)*Account!$X$2)/100)","v":0},{"$f":"IF(Account!$AC$2=0,0,SUM(Account!$AC$2-$D270))","v":0},1,0,0,{"$f":"SUM($V270*Account!$AB$2)","v":0},{"$f":"SUM($W270*Account!$AA$2)","v":0},0]
[270,null,null,null,null,null,null,null,1,{"$f":"IF(Account!$AJ$2=0,0,SUM(Account!$AJ$2-$D271))","v":0},1,0,0,{"$f":"ROUND(SUM($L271*Account!$AI$2),2)","v":0},{"$f":"ROUND(SUM($M271*Account!$AH$2),2)","v":0},{"$f":"IF(Account!$Z$2=0,0,SUM(Account!$Z$2-$D271))","v":0},1,{"$f":"SUM(SUM(SUM(SUM($N271:$O271)/$I271*$P271)*Account!$Y$2)/100)","v":0},{"$f":"SUM(SUM(SUM(SUM($N271:$O271)/$I271*$Q271)*Account!$X$2)/100)","v":0},{"$f":"IF(Account!$AC$2=0,0,SUM(Account!$AC$2-$D271))","v":0},1,0,0,{"$f":"SUM($V271*Account!$AB$2)","v":0},{"$f":"SUM($W271*Account!$AA$2)","v":0},0]
[271,null,null,null,null,null,null,null,1,{"$f":"IF(Account!$AJ$2=0,0,SUM(Account!$AJ$2-$D272))","v":0},1,0,0,{"$f":"ROUND(SUM($L272*Account!$AI$2),2)","v":0},{"$f":"ROUND(SUM($M272*Account!$AH$2),2)","v":0},{"$f":"IF(Account!$Z$2=0,0,SUM(Account!$Z$2-$D272))","v":0},1,{"$f":"SUM(SUM(SUM(SUM($N272:$O272)/$I272*$P272)*Account!$Y$2)/100)","v":0},{"$f":"SUM(SUM(SUM(SUM($N272:$O272)/$I272*$Q272)*Account!$X$2)/100)","v":0},{"$f":"IF(Account!$AC$2=0,0,SUM(Account!$AC$2-$D272))","v":0},1,0,0,{"$f":"SUM($V272*Account!$AB$2)","v":0},{"$f":"SUM($W272*Account!$AA$2)","v":0},0]
[272,null,null,null,null,null,null,null,1,{"$f":"IF(Account!$AJ$2=0,0,SUM(Account!$AJ$2-$D273))","v":0},1,0,0,{"$f":"ROUND(SUM($L273*Account!$AI$2),2)","v":0},{"$f":"ROUND(SUM($M273*Account!$AH$2),2)","v":0},{"$f":"IF(Account!$Z$2=0,0,SUM(Account!$Z$2-$D273))","v":0},1,{"$f":"SUM(SUM(SUM(SUM($N273:$O273)/$I273*$P273)*Account!$Y$2)/100)","v":0},{"$f":"SUM(SUM(SUM(SUM($N273:$O273)/$I273*$Q273)*Account!$X$2)/100)","v":0},{"$f":"IF(Account!$AC$2=0,0,SUM(Account!$AC$2-$D273))","v":0},1,0,0,{"$f":"SUM($V273*Account!$AB$2)","v":0},{"$f":"SUM($W273*Account!$AA$2)","v":0},0]
[273,null,null,null,null,null,null,null,1,{"$f":"IF(Account!$AJ$2=0,0,SUM(Account!$AJ$2-$D274))","v":0},1,0,0,{"$f":"ROUND(SUM($L274*Account!$AI$2),2)","v":0},{"$f":"ROUND(SUM($M274*Account!$AH$2),2)","v":0},{"$f":"IF(Account!$Z$2=0,0,SUM(Account!$Z$2-$D274))","v":0},1,{"$f":"SUM(SUM(SUM(SUM($N274:$O274)/$I274*$P274)*Account!$Y$2)/100)","v":0},{"$f":"SUM(SUM(SUM(SUM($N274:$O274)/$I274*$Q274)*Account!$X$2)/100)","v":0},{"$f":"IF(Account!$AC$2=0,0,SUM(Account!$AC$2-$D274))","v":0},1,0,0,{"$f":"SUM($V274*Account!$AB$2)","v":0},{"$f":"SUM($W274*Account!$AA$2)","v":0},0]
[274,null,null,null,null,null,null,null,1,{"$f":"IF(Account!$AJ$2=0,0,SUM(Account!$AJ$2-$D275))","v":0},1,0,0,{"$f":"ROUND(SUM($L275*Account!$AI$2),2)","v":0},{"$f":"ROUND(SUM($M275*Account!$AH$2),2)","v":0},{"$f":"IF(Account!$Z$2=0,0,SUM(Account!$Z$2-$D275))","v":0},1,{"$f":"SUM(SUM(SUM(SUM($N275:$O275)/$I275*$P275)*Account!$Y$2)/100)","v":0},{"$f":"SUM(SUM(SUM(SUM($N275:$O275)/$I275*$Q275)*Account!$X$2)/100)","v":0},{"$f":"IF(Account!$AC$2=0,0,SUM(Account!$AC$2-$D275))","v":0},1,0,0,{"$f":"SUM($V275*Account!$AB$2)","v":0},{"$f":"SUM($W275*Account!$AA$2)","v":0},0]
[275,null,null,null,null,null,null,null,1,{"$f":"IF(Account!$AJ$2=0,0,SUM(Account!$AJ$2-$D276))","v":0},1,0,0,{"$f":"ROUND(SUM($L276*Account!$AI$2),2)","v":0},{"$f":"ROUND(SUM($M276*Account!$AH$2),2)","v":0},{"$f":"IF(Account!$Z$2=0,0,SUM(Account!$Z$2-$D276))","v":0},1,{"$f":"SUM(SUM(SUM(SUM($N276:$O276)/$I276*$P276)*Account!$Y$2)/100)","v":0},{"$f":"SUM(SUM(SUM(SUM($N276:$O276)/$I276*$Q276)*Account!$X$2)/100)","v":0},{"$f":"IF(Account!$AC$2=0,0,SUM(Account!$AC$2-$D276))","v":0},1,0,0,{"$f":"SUM($V276*Account!$AB$2)","v":0},{"$f":"SUM($W276*Account!$AA$2)","v":0},0]
[276,null,null,null,null,null,null,null,1,{"$f":"IF(Account!$AJ$2=0,0,SUM(Account!$AJ$2-$D277))","v":0},1,0,0,{"$f":"ROUND(SUM($L277*Account!$AI$2),2)","v":0},{"$f":"ROUND(SUM($M277*Account!$AH$2),2)","v":0},{"$f":"IF(Account!$Z$2=0,0,SUM(Account!$Z$2-$D277))","v":0},1,{"$f":"SUM(SUM(SUM(SUM($N277:$O277)/$I277*$P277)*Account!$Y$2)/100)","v":0},{"$f":"SUM(SUM(SUM(SUM($N277:$O277)/$I277*$Q277)*Account!$X$2)/100)","v":0},{"$f":"IF(Account!$AC$2=0,0,SUM(Account!$AC$2-$D277))","v":0},1,0,0,{"$f":"SUM($V277*Account!$AB$2)","v":0},{"$f":"SUM($W277*Account!$AA$2)","v":0},0]
[277,null,null,null,null,null,null,null,1,{"$f":"IF(Account!$AJ$2=0,0,SUM(Account!$AJ$2-$D278))","v":0},1,0,0,{"$f":"ROUND(SUM($L278*Account!$AI$2),2)","v":0},{"$f":"ROUND(SUM($M278*Account!$AH$2),2)","v":0},{"$f":"IF(Account!$Z$2=0,0,SUM(Account!$Z$2-$D278))","v":0},1,{"$f":"SUM(SUM(SUM(SUM($N278:$O278)/$I278*$P278)*Account!$Y$2)/100)","v":0},{"$f":"SUM(SUM(SUM(SUM($N278:$O278)/$I278*$Q278)*Account!$X$2)/100)","v":0},{"$f":"IF(Account!$AC$2=0,0,SUM(Account!$AC$2-$D278))","v":0},1,0,0,{"$f":"SUM($V278*Account!$AB$2)","v":0},{"$f":"SUM($W278*Account!$AA$2)","v":0},0]
[278,null,null,null,null,null,null,null,1,{"$f":"IF(Account!$AJ$2=0,0,SUM(Account!$AJ$2-$D279))","v":0},1,0,0,{"$f":"ROUND(SUM($L279*Account!$AI$2),2)","v":0},{"$f":"ROUND(SUM($M279*Account!$AH$2),2)","v":0},{"$f":"IF(Account!$Z$2=0,0,SUM(Account!$Z$2-$D279))","v":0},1,{"$f":"SUM(SUM(SUM(SUM($N279:$O279)/$I279*$P279)*Account!$Y$2)/100)","v":0},{"$f":"SUM(SUM(SUM(SUM($N279:$O279)/$I279*$Q279)*Account!$X$2)/100)","v":0},{"$f":"IF(Account!$AC$2=0,0,SUM(Account!$AC$2-$D279))","v":0},1,0,0,{"$f":"SUM($V279*Account!$AB$2)","v":0},{"$f":"SUM($W279*Account!$AA$2)","v":0},0]
[279,null,null,null,null,null,null,null,1,{"$f":"IF(Account!$AJ$2=0,0,SUM(Account!$AJ$2-$D280))","v":0},1,0,0,{"$f":"ROUND(SUM($L280*Account!$AI$2),2)","v":0},{"$f":"ROUND(SUM($M280*Account!$AH$2),2)","v":0},{"$f":"IF(Account!$Z$2=0,0,SUM(Account!$Z$2-$D280))","v":0},1,{"$f":"SUM(SUM(SUM(SUM($N280:$O280)/$I280*$P280)*Account!$Y$2)/100)","v":0},{"$f":"SUM(SUM(SUM(SUM($N280:$O280)/$I280*$Q280)*Account!$X$2)/100)","v":0},{"$f":"IF(Account!$AC$2=0,0,SUM(Account!$AC$2-$D280))","v":0},1,0,0,{"$f":"SUM($V280*Account!$AB$2)","v":0},{"$f":"SUM($W280*Account!$AA$2)","v":0},0]
[280,null,null,null,null,null,null,null,1,{"$f":"IF(Account!$AJ$2=0,0,SUM(Account!$AJ$2-$D281))","v":0},1,0,0,{"$f":"ROUND(SUM($L281*Account!$AI$2),2)","v":0},{"$f":"ROUND(SUM($M281*Account!$AH$2),2)","v":0},{"$f":"IF(Account!$Z$2=0,0,SUM(Account!$Z$2-$D281))","v":0},1,{"$f":"SUM(SUM(SUM(SUM($N281:$O281)/$I281*$P281)*Account!$Y$2)/100)","v":0},{"$f":"SUM(SUM(SUM(SUM($N281:$O281)/$I281*$Q281)*Account!$X$2)/100)","v":0},{"$f":"IF(Account!$AC$2=0,0,SUM(Account!$AC$2-$D281))","v":0},1,0,0,{"$f":"SUM($V281*Account!$AB$2)","v":0},{"$f":"SUM($W281*Account!$AA$2)","v":0},0]
[281,null,null,null,null,null,null,null,1,{"$f":"IF(Account!$AJ$2=0,0,SUM(Account!$AJ$2-$D282))","v":0},1,0,0,{"$f":"ROUND(SUM($L282*Account!$AI$2),2)","v":0},{"$f":"ROUND(SUM($M282*Account!$AH$2),2)","v":0},{"$f":"IF(Account!$Z$2=0,0,SUM(Account!$Z$2-$D282))","v":0},1,{"$f":"SUM(SUM(SUM(SUM($N282:$O282)/$I282*$P282)*Account!$Y$2)/100)","v":0},{"$f":"SUM(SUM(SUM(SUM($N282:$O282)/$I282*$Q282)*Account!$X$2)/100)","v":0},{"$f":"IF(Account!$AC$2=0,0,SUM(Account!$AC$2-$D282))","v":0},1,0,0,{"$f":"SUM($V282*Account!$AB$2)","v":0},{"$f":"SUM($W282*Account!$AA$2)","v":0},0]
[282,null,null,null,null,null,null,null,1,{"$f":"IF(Account!$AJ$2=0,0,SUM(Account!$AJ$2-$D283))","v":0},1,0,0,{"$f":"ROUND(SUM($L283*Account!$AI$2),2)","v":0},{"$f":"ROUND(SUM($M283*Account!$AH$2),2)","v":0},{"$f":"IF(Account!$Z$2=0,0,SUM(Account!$Z$2-$D283))","v":0},1,{"$f":"SUM(SUM(SUM(SUM($N283:$O283)/$I283*$P283)*Account!$Y$2)/100)","v":0},{"$f":"SUM(SUM(SUM(SUM($N283:$O283)/$I283*$Q283)*Account!$X$2)/100)","v":0},{"$f":"IF(Account!$AC$2=0,0,SUM(Account!$AC$2-$D283))","v":0},1,0,0,{"$f":"SUM($V283*Account!$AB$2)","v":0},{"$f":"SUM($W283*Account!$AA$2)","v":0},0]
[283,null,null,null,null,null,null,null,1,{"$f":"IF(Account!$AJ$2=0,0,SUM(Account!$AJ$2-$D284))","v":0},1,0,0,{"$f":"ROUND(SUM($L284*Account!$AI$2),2)","v":0},{"$f":"ROUND(SUM($M284*Account!$AH$2),2)","v":0},{"$f":"IF(Account!$Z$2=0,0,SUM(Account!$Z$2-$D284))","v":0},1,{"$f":"SUM(SUM(SUM(SUM($N284:$O284)/$I284*$P284)*Account!$Y$2)/100)","v":0},{"$f":"SUM(SUM(SUM(SUM($N284:$O284)/$I284*$Q284)*Account!$X$2)/100)","v":0},{"$f":"IF(Account!$AC$2=0,0,SUM(Account!$AC$2-$D284))","v":0},1,0,0,{"$f":"SUM($V284*Account!$AB$2)","v":0},{"$f":"SUM($W284*Account!$AA$2)","v":0},0]
[284,null,null,null,null,null,null,null,1,{"$f":"IF(Account!$AJ$2=0,0,SUM(Account!$AJ$2-$D285))","v":0},1,0,0,{"$f":"ROUND(SUM($L285*Account!$AI$2),2)","v":0},{"$f":"ROUND(SUM($M285*Account!$AH$2),2)","v":0},{"$f":"IF(Account!$Z$2=0,0,SUM(Account!$Z$2-$D285))","v":0},1,{"$f":"SUM(SUM(SUM(SUM($N285:$O285)/$I285*$P285)*Account!$Y$2)/100)","v":0},{"$f":"SUM(SUM(SUM(SUM($N285:$O285)/$I285*$Q285)*Account!$X$2)/100)","v":0},{"$f":"IF(Account!$AC$2=0,0,SUM(Account!$AC$2-$D285))","v":0},1,0,0,{"$f":"SUM($V285*Account!$AB$2)","v":0},{"$f":"SUM($W285*Account!$AA$2)","v":0},0]
[285,null,null,null,null,null,null,null,1,{"$f":"IF(Account!$AJ$2=0,0,SUM(Account!$AJ$2-$D286))","v":0},1,0,0,{"$f":"ROUND(SUM($L286*Account!$AI$2),2)","v":0},{"$f":"ROUND(SUM($M286*Account!$AH$2),2)","v":0},{"$f":"IF(Account!$Z$2=0,0,SUM(Account!$Z$2-$D286))","v":0},1,{"$f":"SUM(SUM(SUM(SUM($N286:$O286)/$I286*$P286)*Account!$Y$2)/100)","v":0},{"$f":"SUM(SUM(SUM(SUM($N286:$O286)/$I286*$Q286)*Account!$X$2)/100)","v":0},{"$f":"IF(Account!$AC$2=0,0,SUM(Account!$AC$2-$D286))","v":0},1,0,0,{"$f":"SUM($V286*Account!$AB$2)","v":0},{"$f":"SUM($W286*Account!$AA$2)","v":0},0]
[286,null,null,null,null,null,null,null,1,{"$f":"IF(Account!$AJ$2=0,0,SUM(Account!$AJ$2-$D287))","v":0},1,0,0,{"$f":"ROUND(SUM($L287*Account!$AI$2),2)","v":0},{"$f":"ROUND(SUM($M287*Account!$AH$2),2)","v":0},{"$f":"IF(Account!$Z$2=0,0,SUM(Account!$Z$2-$D287))","v":0},1,{"$f":"SUM(SUM(SUM(SUM($N287:$O287)/$I287*$P287)*Account!$Y$2)/100)","v":0},{"$f":"SUM(SUM(SUM(SUM($N287:$O287)/$I287*$Q287)*Account!$X$2)/100)","v":0},{"$f":"IF(Account!$AC$2=0,0,SUM(Account!$AC$2-$D287))","v":0},1,0,0,{"$f":"SUM($V287*Account!$AB$2)","v":0},{"$f":"SUM($W287*Account!$AA$2)","v":0},0]
[287,null,null,null,null,null,null,null,1,{"$f":"IF(Account!$AJ$2=0,0,SUM(Account!$AJ$2-$D288))","v":0},1,0,0,{"$f":"ROUND(SUM($L288*Account!$AI$2),2)","v":0},{"$f":"ROUND(SUM($M288*Account!$AH$2),2)","v":0},{"$f":"IF(Account!$Z$2=0,0,SUM(Account!$Z$2-$D288))","v":0},1,{"$f":"SUM(SUM(SUM(SUM($N288:$O288)/$I288*$P288)*Account!$Y$2)/100)","v":0},{"$f":"SUM(SUM(SUM(SUM($N288:$O288)/$I288*$Q288)*Account!$X$2)/100)","v":0},{"$f":"IF(Account!$AC$2=0,0,SUM(Account!$AC$2-$D288))","v":0},1,0,0,{"$f":"SUM($V288*Account!$AB$2)","v":0},{"$f":"SUM($W288*Account!$AA$2)","v":0},0]
[288,null,null,null,null,null,null,null,1,{"$f":"IF(Account!$AJ$2=0,0,SUM(Account!$AJ$2-$D289))","v":0},1,0,0,{"$f":"ROUND(SUM($L289*Account!$AI$2),2)","v":0},{"$f":"ROUND(SUM($M289*Account!$AH$2),2)","v":0},{"$f":"IF(Account!$Z$2=0,0,SUM(Account!$Z$2-$D289))","v":0},1,{"$f":"SUM(SUM(SUM(SUM($N289:$O289)/$I289*$P289)*Account!$Y$2)/100)","v":0},{"$f":"SUM(SUM(SUM(SUM($N289:$O289)/$I289*$Q289)*Account!$X$2)/100)","v":0},{"$f":"IF(Account!$AC$2=0,0,SUM(Account!$AC$2-$D289))","v":0},1,0,0,{"$f":"SUM($V289*Account!$AB$2)","v":0},{"$f":"SUM($W289*Account!$AA$2)","v":0},0]
[289,null,null,null,null,null,null,null,1,{"$f":"IF(Account!$AJ$2=0,0,SUM(Account!$AJ$2-$D290))","v":0},1,0,0,{"$f":"ROUND(SUM($L290*Account!$AI$2),2)","v":0},{"$f":"ROUND(SUM($M290*Account!$AH$2),2)","v":0},{"$f":"IF(Account!$Z$2=0,0,SUM(Account!$Z$2-$D290))","v":0},1,{"$f":"SUM(SUM(SUM(SUM($N290:$O290)/$I290*$P290)*Account!$Y$2)/100)","v":0},{"$f":"SUM(SUM(SUM(SUM($N290:$O290)/$I290*$Q290)*Account!$X$2)/100)","v":0},{"$f":"IF(Account!$AC$2=0,0,SUM(Account!$AC$2-$D290))","v":0},1,0,0,{"$f":"SUM($V290*Account!$AB$2)","v":0},{"$f":"SUM($W290*Account!$AA$2)","v":0},0]
[290,null,null,null,null,null,null,null,1,{"$f":"IF(Account!$AJ$2=0,0,SUM(Account!$AJ$2-$D291))","v":0},1,0,0,{"$f":"ROUND(SUM($L291*Account!$AI$2),2)","v":0},{"$f":"ROUND(SUM($M291*Account!$AH$2),2)","v":0},{"$f":"IF(Account!$Z$2=0,0,SUM(Account!$Z$2-$D291))","v":0},1,{"$f":"SUM(SUM(SUM(SUM($N291:$O291)/$I291*$P291)*Account!$Y$2)/100)","v":0},{"$f":"SUM(SUM(SUM(SUM($N291:$O291)/$I291*$Q291)*Account!$X$2)/100)","v":0},{"$f":"IF(Account!$AC$2=0,0,SUM(Account!$AC$2-$D291))","v":0},1,0,0,{"$f":"SUM($V291*Account!$AB$2)","v":0},{"$f":"SUM($W291*Account!$AA$2)","v":0},0]
[291,null,null,null,null,null,null,null,1,{"$f":"IF(Account!$AJ$2=0,0,SUM(Account!$AJ$2-$D292))","v":0},1,0,0,{"$f":"ROUND(SUM($L292*Account!$AI$2),2)","v":0},{"$f":"ROUND(SUM($M292*Account!$AH$2),2)","v":0},{"$f":"IF(Account!$Z$2=0,0,SUM(Account!$Z$2-$D292))","v":0},1,{"$f":"SUM(SUM(SUM(SUM($N292:$O292)/$I292*$P292)*Account!$Y$2)/100)","v":0},{"$f":"SUM(SUM(SUM(SUM($N292:$O292)/$I292*$Q292)*Account!$X$2)/100)","v":0},{"$f":"IF(Account!$AC$2=0,0,SUM(Account!$AC$2-$D292))","v":0},1,0,0,{"$f":"SUM($V292*Account!$AB$2)","v":0},{"$f":"SUM($W292*Account!$AA$2)","v":0},0]
[292,null,null,null,null,null,null,null,1,{"$f":"IF(Account!$AJ$2=0,0,SUM(Account!$AJ$2-$D293))","v":0},1,0,0,{"$f":"ROUND(SUM($L293*Account!$AI$2),2)","v":0},{"$f":"ROUND(SUM($M293*Account!$AH$2),2)","v":0},{"$f":"IF(Account!$Z$2=0,0,SUM(Account!$Z$2-$D293))","v":0},1,{"$f":"SUM(SUM(SUM(SUM($N293:$O293)/$I293*$P293)*Account!$Y$2)/100)","v":0},{"$f":"SUM(SUM(SUM(SUM($N293:$O293)/$I293*$Q293)*Account!$X$2)/100)","v":0},{"$f":"IF(Account!$AC$2=0,0,SUM(Account!$AC$2-$D293))","v":0},1,0,0,{"$f":"SUM($V293*Account!$AB$2)","v":0},{"$f":"SUM($W293*Account!$AA$2)","v":0},0]
[293,null,null,null,null,null,null,null,1,{"$f":"IF(Account!$AJ$2=0,0,SUM(Account!$AJ$2-$D294))","v":0},1,0,0,{"$f":"ROUND(SUM($L294*Account!$AI$2),2)","v":0},{"$f":"ROUND(SUM($M294*Account!$AH$2),2)","v":0},{"$f":"IF(Account!$Z$2=0,0,SUM(Account!$Z$2-$D294))","v":0},1,{"$f":"SUM(SUM(SUM(SUM($N294:$O294)/$I294*$P294)*Account!$Y$2)/100)","v":0},{"$f":"SUM(SUM(SUM(SUM($N294:$O294)/$I294*$Q294)*Account!$X$2)/100)","v":0},{"$f":"IF(Account!$AC$2=0,0,SUM(Account!$AC$2-$D294))","v":0},1,0,0,{"$f":"SUM($V294*Account!$AB$2)","v":0},{"$f":"SUM($W294*Account!$AA$2)","v":0},0]
[294,null,null,null,null,null,null,null,1,{"$f":"IF(Account!$AJ$2=0,0,SUM(Account!$AJ$2-$D295))","v":0},1,0,0,{"$f":"ROUND(SUM($L295*Account!$AI$2),2)","v":0},{"$f":"ROUND(SUM($M295*Account!$AH$2),2)","v":0},{"$f":"IF(Account!$Z$2=0,0,SUM(Account!$Z$2-$D295))","v":0},1,{"$f":"SUM(SUM(SUM(SUM($N295:$O295)/$I295*$P295)*Account!$Y$2)/100)","v":0},{"$f":"SUM(SUM(SUM(SUM($N295:$O295)/$I295*$Q295)*Account!$X$2)/100)","v":0},{"$f":"IF(Account!$AC$2=0,0,SUM(Account!$AC$2-$D295))","v":0},1,0,0,{"$f":"SUM($V295*Account!$AB$2)","v":0},{"$f":"SUM($W295*Account!$AA$2)","v":0},0]
[295,null,null,null,null,null,null,null,1,{"$f":"IF(Account!$AJ$2=0,0,SUM(Account!$AJ$2-$D296))","v":0},1,0,0,{"$f":"ROUND(SUM($L296*Account!$AI$2),2)","v":0},{"$f":"ROUND(SUM($M296*Account!$AH$2),2)","v":0},{"$f":"IF(Account!$Z$2=0,0,SUM(Account!$Z$2-$D296))","v":0},1,{"$f":"SUM(SUM(SUM(SUM($N296:$O296)/$I296*$P296)*Account!$Y$2)/100)","v":0},{"$f":"SUM(SUM(SUM(SUM($N296:$O296)/$I296*$Q296)*Account!$X$2)/100)","v":0},{"$f":"IF(Account!$AC$2=0,0,SUM(Account!$AC$2-$D296))","v":0},1,0,0,{"$f":"SUM($V296*Account!$AB$2)","v":0},{"$f":"SUM($W296*Account!$AA$2)","v":0},0]
[296,null,null,null,null,null,null,null,1,{"$f":"IF(Account!$AJ$2=0,0,SUM(Account!$AJ$2-$D297))","v":0},1,0,0,{"$f":"ROUND(SUM($L297*Account!$AI$2),2)","v":0},{"$f":"ROUND(SUM($M297*Account!$AH$2),2)","v":0},{"$f":"IF(Account!$Z$2=0,0,SUM(Account!$Z$2-$D297))","v":0},1,{"$f":"SUM(SUM(SUM(SUM($N297:$O297)/$I297*$P297)*Account!$Y$2)/100)","v":0},{"$f":"SUM(SUM(SUM(SUM($N297:$O297)/$I297*$Q297)*Account!$X$2)/100)","v":0},{"$f":"IF(Account!$AC$2=0,0,SUM(Account!$AC$2-$D297))","v":0},1,0,0,{"$f":"SUM($V297*Account!$AB$2)","v":0},{"$f":"SUM($W297*Account!$AA$2)","v":0},0]
[297,null,null,null,null,null,null,null,1,{"$f":"IF(Account!$AJ$2=0,0,SUM(Account!$AJ$2-$D298))","v":0},1,0,0,{"$f":"ROUND(SUM($L298*Account!$AI$2),2)","v":0},{"$f":"ROUND(SUM($M298*Account!$AH$2),2)","v":0},{"$f":"IF(Account!$Z$2=0,0,SUM(Account!$Z$2-$D298))","v":0},1,{"$f":"SUM(SUM(SUM(SUM($N298:$O298)/$I298*$P298)*Account!$Y$2)/100)","v":0},{"$f":"SUM(SUM(SUM(SUM($N298:$O298)/$I298*$Q298)*Account!$X$2)/100)","v":0},{"$f":"IF(Account!$AC$2=0,0,SUM(Account!$AC$2-$D298))","v":0},1,0,0,{"$f":"SUM($V298*Account!$AB$2)","v":0},{"$f":"SUM($W298*Account!$AA$2)","v":0},0]
[298,null,null,null,null,null,null,null,1,{"$f":"IF(Account!$AJ$2=0,0,SUM(Account!$AJ$2-$D299))","v":0},1,0,0,{"$f":"ROUND(SUM($L299*Account!$AI$2),2)","v":0},{"$f":"ROUND(SUM($M299*Account!$AH$2),2)","v":0},{"$f":"IF(Account!$Z$2=0,0,SUM(Account!$Z$2-$D299))","v":0},1,{"$f":"SUM(SUM(SUM(SUM($N299:$O299)/$I299*$P299)*Account!$Y$2)/100)","v":0},{"$f":"SUM(SUM(SUM(SUM($N299:$O299)/$I299*$Q299)*Account!$X$2)/100)","v":0},{"$f":"IF(Account!$AC$2=0,0,SUM(Account!$AC$2-$D299))","v":0},1,0,0,{"$f":"SUM($V299*Account!$AB$2)","v":0},{"$f":"SUM($W299*Account!$AA$2)","v":0},0]
[299,null,null,null,null,null,null,null,1,{"$f":"IF(Account!$AJ$2=0,0,SUM(Account!$AJ$2-$D300))","v":0},1,0,0,{"$f":"ROUND(SUM($L300*Account!$AI$2),2)","v":0},{"$f":"ROUND(SUM($M300*Account!$AH$2),2)","v":0},{"$f":"IF(Account!$Z$2=0,0,SUM(Account!$Z$2-$D300))","v":0},1,{"$f":"SUM(SUM(SUM(SUM($N300:$O300)/$I300*$P300)*Account!$Y$2)/100)","v":0},{"$f":"SUM(SUM(SUM(SUM($N300:$O300)/$I300*$Q300)*Account!$X$2)/100)","v":0},{"$f":"IF(Account!$AC$2=0,0,SUM(Account!$AC$2-$D300))","v":0},1,0,0,{"$f":"SUM($V300*Account!$AB$2)","v":0},{"$f":"SUM($W300*Account!$AA$2)","v":0},0]
[300,null,null,null,null,null,null,null,1,{"$f":"IF(Account!$AJ$2=0,0,SUM(Account!$AJ$2-$D301))","v":0},1,0,0,{"$f":"ROUND(SUM($L301*Account!$AI$2),2)","v":0},{"$f":"ROUND(SUM($M301*Account!$AH$2),2)","v":0},{"$f":"IF(Account!$Z$2=0,0,SUM(Account!$Z$2-$D301))","v":0},1,{"$f":"SUM(SUM(SUM(SUM($N301:$O301)/$I301*$P301)*Account!$Y$2)/100)","v":0},{"$f":"SUM(SUM(SUM(SUM($N301:$O301)/$I301*$Q301)*Account!$X$2)/100)","v":0},{"$f":"IF(Account!$AC$2=0,0,SUM(Account!$AC$2-$D301))","v":0},1,0,0,{"$f":"SUM($V301*Account!$AB$2)","v":0},{"$f":"SUM($W301*Account!$AA$2)","v":0},0]

{"sheet":"ACTVMHPACCNT","index":5,"n_rows":30,"n_cols":17,"rows_kept":30,"cut":false,"hidden":true,"merged":[]}
["Cntrct","Nm","StrtAddrss","Cty","Stt","ZpCd","Instlltn","DtFrm","DtTo","MPH","Mlt_Dwllng","CCA","DA","DACntns","DARtrnngCntns","VntgYr","BslnRgn"]
[8000096981,"TERESA JACOBS","3639 W INYOKERN RD","RIDGECREST","CA","93555-8547",901740529,"2010-09-27","9999-12-31","X","X",null,null,null,null,".",14]
[8000101192,"LEEDS PROP MGT 05","1404 GLENWOOD LN","BISHOP","CA","93514-1921",901725622,"2012-02-29","9999-12-31","X","X",null,null,null,null,".",16]
[8000263668,"SANDS MOBILE HOME PARK","415 W RIDGECREST BLVD","RIDGECREST","CA","93555-4046",904358684,"2010-09-27","9999-12-31","X","X",null,null,null,null,".",14]
[8000546385,"MARK SZYMANSKI","26925 LADERA ST","REDLANDS","CA","92373-4373",905174431,"2014-01-28","9999-12-31","X","X",null,null,null,null,".",10]
[8000736604,"DAVID THOR","21592 BUNDY CANYON RD","WILDOMAR","CA","92595-8776",901750943,"2019-10-11","9999-12-31","X","X",null,null,null,null,".",16]
[8001808742,"HIDDEN BEACHES RIVR RESORT LLC","6951 6TH AVE","BLYTHE","CA","92225-9330",900606158,"2006-07-03","9999-12-31","X","X",null,null,null,null,".",15]
[8001808839,"HIDDEN BEACHES RIVR RESORT LLC","6951 6TH AVE","BLYTHE","CA","92225-9330",902863306,"2006-07-03","9999-12-31","X","X",null,null,null,null,".",15]
[8001839457,"THOMPSON AND ALLEN","26 S VENTU PARK RD","NEWBURY PARK","CA","91320-3942",901713715,"2018-04-10","9999-12-31","X","X","X",null,null,null,".",9]
[8002061817,"MITCHELL AVENUE E PARK, INC","1024 DELAWARE RD","BURBANK","CA","91504-3025",903630857,"2014-04-10","9999-12-31","X","X",null,null,null,null,".",14]
[8002133122,"MURLIN, SHELLY","41659 AVENIDA ORTEGA","TEMECULA","CA","92592-8980",904462773,"2015-12-18","9999-12-31","X","X",null,null,null,null,".",16]
[8002294370,"HAKSE KIM","1548 N TOPANGA CANYON BLVD, SPC 15","TOPANGA","CA","90290-4389",903182397,"2012-03-15","9999-12-31","X","X","X",null,null,null,2018,6]
[8002523989,"JENS IPSEN","11920 WHALERS LN","MALIBU","CA","90265-2252",901984499,"2007-03-12","9999-12-31","X","X",null,null,null,null,".",14]
[8002643476,"JERRY HUSBAND","363 E KAMALA ST","OXNARD","CA","93033-3847",903133247,"2013-01-19","9999-12-31","X","X",null,null,null,null,".",16]
[8002651045,"JERRY HUSBAND","363 E KAMALA ST","OXNARD","CA","93033-3847",903195130,"2013-01-19","9999-12-31","X","X",null,null,null,null,".",16]
[8002751176,"RAYMOND PEALE","1360 NAPLES CT","SIMI VALLEY","CA","93065-4137",901742557,"2016-09-27","9999-12-31","X","X",null,null,null,null,".",16]
[8003229669,"MICKEY HOWARD","PO BOX 1534","LUCERNE VALLEY","CA","92356-1534",902957961,"2016-12-29","9999-12-31","X","X",null,null,null,null,".",14]
[8003435128,"RIVERNOOK CAMP GRND","14001 SIERRA WAY","KERNVILLE","CA","93238-9704",903711336,"2016-10-11","9999-12-31","X","X",null,null,null,null,".",16]
[8003435302,"RIVERNOOK CAMP GRND","14001 SIERRA WAY","KERNVILLE","CA","93238-9704",903381678,"2016-10-11","9999-12-31","X","X",null,null,null,null,".",16]
[8003435310,"CAMARILLO SPRINGS CCV","801 CAMARILLO SPRINGS RD","CAMARILLO","CA","93012-9445",902994242,"2011-05-02","9999-12-31","X","X","X",null,null,null,".",6]
[8003435524,"RIVERNOOK CAMP GRND","14001 SIERRA WAY","KERNVILLE","CA","93238-9704",903164846,"2016-10-11","9999-12-31","X","X",null,null,null,null,".",16]
[8003442734,"JENS IPSEN","11920 WHALERS LN","MALIBU","CA","90265-2252",903336565,"2007-03-12","9999-12-31","X","X",null,null,null,null,".",14]
[8003570131,"KEN LLC","4634 SALOMA AVE","SHERMAN OAKS","CA","91403-2511",902546766,"2011-05-02","9999-12-31","X","X",null,null,null,null,".",10]
[8003646224,"CATHEY DEEN","2025 LERIDA PL","ROSEMEAD","CA","91770-3419",903494904,"2006-06-30","9999-12-31","X","X",null,null,null,null,".",14]
[8003707359,"STAN MATLICK","2324 HOMESTEAD LN","BISHOP","CA","93514-2022",903198236,"2011-08-04","9999-12-31","X","X",null,null,null,null,".",16]
[8004170566,"DESERT CAPRI MOBILE HOME PARK","11423 CHAMBERLAINE WAY, SPC","ADELANTO","CA","92301-2865",903021673,"2014-05-22","9999-12-31","X","X",null,null,null,null,".",14]
[8004288952,"SYCAMORE PARK, L.P.","396 S CALIFORNIA AVE, UNIT 1138","WEST COVINA","CA","91793-3445",903980206,"2016-08-30","9999-12-31","X","X",null,null,null,null,".",10]
[8004662791,"CARTER-SPENCER ENERPRISES LLC","425 E GARDENA BLVD","GARDENA","CA","90248-2913",903893357,"2011-09-17","9999-12-31","X","X","X",null,null,null,2018,8]
[8005130627,"RIVERNOOK CAMP GRND","14001 SIERRA WAY","KERNVILLE","CA","93238-9704",902400904,"2016-10-11","9999-12-31","X","X",null,null,null,null,".",16]
[8002920346,"GEORGE CHEADLE","PO BOX 127","OCEANSIDE","CA","92049-0127",903065777,"2006-10-27","9999-12-31","X","X",null,null,null,null,".",13]

{"sheet":"BllSmmry","index":6,"n_rows":301,"n_cols":34,"rows_kept":301,"cut":false,"hidden":true,"merged":[]}
[{"$f":"Tenant!$A1","v":"ID"},{"$f":"Account!$C$1","v":"CntrctNm"},{"$f":"Account!$I$1","v":"BllngRt"},{"$f":"Tenant!$B1","v":"TnntNm"},{"$f":"Tenant!$C1","v":"TnntAddrss"},{"$f":"Tenant!$D1","v":"TnntNmbr"},{"$f":"Tenant!$E1","v":"SbMtrBllngRt"},{"$f":"Tenant!$G1","v":"MdclDvcs"},{"$f":"Usage!$D1","v":"BllPrdStrtDt"},{"$f":"Usage!$E1","v":"BllPrdEndDt"},{"$f":"Usage!$F1","v":"SbMtrRdStrt"},{"$f":"Usage!$G1","v":"SbMtrRdEnd"},{"$f":"Usage!$H1","v":"TtlUsg"},{"$f":"Usage!$L1","v":"OldkWhCCARt"},{"$f":"Usage!$N1","v":"CCARtPrvs"},{"$f":"Usage!$N1&\"Ttl\"","v":"CCARtPrvsTtl"},{"$f":"Usage!$M1","v":"NwkWhCCARt"},{"$f":"Usage!$O1","v":"CCARtCrrnt"},{"$f":"Usage!$O1&\"Ttl\"","v":"CCARtCrrntTtl"},"CCAGnrtnSbttl",{"$f":"Tenant!$H1","v":"UUTExmpt"},{"$f":"Account!$Y$1","v":"UUTPrvs"},{"$f":"Usage!$R1","v":"CCAUUTTxPrvs"},{"$f":"Account!$X$1","v":"UUTCrrnt"},{"$f":"Usage!$S1","v":"CCAUUTTxCrrnt"},{"$f":"Tenant!$I1","v":"SttTxExmpt"},{"$f":"Usage!$V1","v":"OldkWhCCAEnrgySrchrg"},{"$f":"Account!$AB$1&\"Fctr\"","v":"SttTxPrvsFctr"},{"$f":"Usage!$X1","v":"CCAEnrgySrchrgPrvs"},{"$f":"Usage!$W1","v":"NwkWhCCAEnrgySrchrg"},{"$f":"Account!$AA$1&\"Fctr\"","v":"SttTxCrrntFctr"},{"$f":"Usage!$Y1","v":"CCAEnrgySrchrgCrrnt"},{"$f":"Usage!$Z1","v":"CCASbttlOfChrgs"},"YrNwChrgs"]
[{"$f":"Tenant!$A2","v":1},{"$f":"Account!$C$2","v":0},{"$f":"Account!$I$2","v":0},{"$f":"Tenant!$B2","v":0},{"$f":"Tenant!$C2","v":0},{"$f":"Tenant!$D2","v":0},{"$f":"Tenant!$E2","v":0},{"$f":"Tenant!$G2","v":0},{"$f":"Usage!$D2","v":"00:00:00"},{"$f":"Usage!$E2","v":"00:00:00"},{"$f":"Usage!$F2","v":0},{"$f":"Usage!$G2","v":0},{"$f":"Usage!$H2","v":0},{"$f":"Usage!$L2","v":0},{"$f":"Account!$AI$2","v":0},{"$f":"Usage!$N2","v":0},{"$f":"Usage!$M2","v":0},{"$f":"Account!$AH$2","v":0},{"$f":"Usage!$O2","v":0},{"$f":"SUM($P2,$S2)","v":0},{"$f":"Tenant!$H2","v":0},{"$f":"Account!$Y$2/100","v":0},{"$f":"Usage!$R2","v":0},{"$f":"Account!$X$2/100","v":0},{"$f":"Usage!$S2","v":0},{"$f":"Tenant!$I2","v":0},{"$f":"Usage!$V2","v":0},{"$f":"Account!$AB$2","v":0},{"$f":"Usage!$X2","v":0},{"$f":"Usage!$W2","v":0},{"$f":"Account!$AA$2","v":0},{"$f":"Usage!$Y2","v":0},{"$f":"Usage!$Z2","v":0},{"$f":"$AG2","v":0}]
[{"$f":"Tenant!$A3","v":2},{"$f":"Account!$C$2","v":0},{"$f":"Account!$I$2","v":0},{"$f":"Tenant!$B3","v":0},{"$f":"Tenant!$C3","v":0},{"$f":"Tenant!$D3","v":0},{"$f":"Tenant!$E3","v":0},{"$f":"Tenant!$G3","v":0},{"$f":"Usage!$D3","v":"00:00:00"},{"$f":"Usage!$E3","v":"00:00:00"},{"$f":"Usage!$F3","v":0},{"$f":"Usage!$G3","v":0},{"$f":"Usage!$H3","v":0},{"$f":"Usage!$L3","v":0},{"$f":"Account!$AI$2","v":0},{"$f":"Usage!$N3","v":0},{"$f":"Usage!$M3","v":0},{"$f":"Account!$AH$2","v":0},{"$f":"Usage!$O3","v":0},{"$f":"SUM($P3,$S3)","v":0},{"$f":"Tenant!$H3","v":0},{"$f":"Account!$Y$2/100","v":0},{"$f":"Usage!$R3","v":0},{"$f":"Account!$X$2/100","v":0},{"$f":"Usage!$S3","v":0},{"$f":"Tenant!$I3","v":0},{"$f":"Usage!$V3","v":0},{"$f":"Account!$AB$2","v":0},{"$f":"Usage!$X3","v":0},{"$f":"Usage!$W3","v":0},{"$f":"Account!$AA$2","v":0},{"$f":"Usage!$Y3","v":0},{"$f":"Usage!$Z3","v":0},{"$f":"$AG3","v":0}]
[{"$f":"Tenant!$A4","v":3},{"$f":"Account!$C$2","v":0},{"$f":"Account!$I$2","v":0},{"$f":"Tenant!$B4","v":0},{"$f":"Tenant!$C4","v":0},{"$f":"Tenant!$D4","v":0},{"$f":"Tenant!$E4","v":0},{"$f":"Tenant!$G4","v":0},{"$f":"Usage!$D4","v":"00:00:00"},{"$f":"Usage!$E4","v":"00:00:00"},{"$f":"Usage!$F4","v":0},{"$f":"Usage!$G4","v":0},{"$f":"Usage!$H4","v":0},{"$f":"Usage!$L4","v":0},{"$f":"Account!$AI$2","v":0},{"$f":"Usage!$N4","v":0},{"$f":"Usage!$M4","v":0},{"$f":"Account!$AH$2","v":0},{"$f":"Usage!$O4","v":0},0,{"$f":"Tenant!$H4","v":0},{"$f":"Account!$Y$2/100","v":0},{"$f":"Usage!$R4","v":0},{"$f":"Account!$X$2/100","v":0},{"$f":"Usage!$S4","v":0},{"$f":"Tenant!$I4","v":0},{"$f":"Usage!$V4","v":0},{"$f":"Account!$AB$2","v":0},{"$f":"Usage!$X4","v":0},{"$f":"Usage!$W4","v":0},{"$f":"Account!$AA$2","v":0},{"$f":"Usage!$Y4","v":0},{"$f":"Usage!$Z4","v":0},0]
[{"$f":"Tenant!$A5","v":4},{"$f":"Account!$C$2","v":0},{"$f":"Account!$I$2","v":0},{"$f":"Tenant!$B5","v":0},{"$f":"Tenant!$C5","v":0},{"$f":"Tenant!$D5","v":0},{"$f":"Tenant!$E5","v":0},{"$f":"Tenant!$G5","v":0},{"$f":"Usage!$D5","v":"00:00:00"},{"$f":"Usage!$E5","v":"00:00:00"},{"$f":"Usage!$F5","v":0},{"$f":"Usage!$G5","v":0},{"$f":"Usage!$H5","v":0},{"$f":"Usage!$L5","v":0},{"$f":"Account!$AI$2","v":0},{"$f":"Usage!$N5","v":0},{"$f":"Usage!$M5","v":0},{"$f":"Account!$AH$2","v":0},{"$f":"Usage!$O5","v":0},0,{"$f":"Tenant!$H5","v":0},{"$f":"Account!$Y$2/100","v":0},{"$f":"Usage!$R5","v":0},{"$f":"Account!$X$2/100","v":0},{"$f":"Usage!$S5","v":0},{"$f":"Tenant!$I5","v":0},{"$f":"Usage!$V5","v":0},{"$f":"Account!$AB$2","v":0},{"$f":"Usage!$X5","v":0},{"$f":"Usage!$W5","v":0},{"$f":"Account!$AA$2","v":0},{"$f":"Usage!$Y5","v":0},{"$f":"Usage!$Z5","v":0},0]
[{"$f":"Tenant!$A6","v":5},{"$f":"Account!$C$2","v":0},{"$f":"Account!$I$2","v":0},{"$f":"Tenant!$B6","v":0},{"$f":"Tenant!$C6","v":0},{"$f":"Tenant!$D6","v":0},{"$f":"Tenant!$E6","v":0},{"$f":"Tenant!$G6","v":0},{"$f":"Usage!$D6","v":"00:00:00"},{"$f":"Usage!$E6","v":"00:00:00"},{"$f":"Usage!$F6","v":0},{"$f":"Usage!$G6","v":0},{"$f":"Usage!$H6","v":0},{"$f":"Usage!$L6","v":0},{"$f":"Account!$AI$2","v":0},{"$f":"Usage!$N6","v":0},{"$f":"Usage!$M6","v":0},{"$f":"Account!$AH$2","v":0},{"$f":"Usage!$O6","v":0},0,{"$f":"Tenant!$H6","v":0},{"$f":"Account!$Y$2/100","v":0},{"$f":"Usage!$R6","v":0},{"$f":"Account!$X$2/100","v":0},{"$f":"Usage!$S6","v":0},{"$f":"Tenant!$I6","v":0},{"$f":"Usage!$V6","v":0},{"$f":"Account!$AB$2","v":0},{"$f":"Usage!$X6","v":0},{"$f":"Usage!$W6","v":0},{"$f":"Account!$AA$2","v":0},{"$f":"Usage!$Y6","v":0},{"$f":"Usage!$Z6","v":0},0]
[{"$f":"Tenant!$A7","v":6},{"$f":"Account!$C$2","v":0},{"$f":"Account!$I$2","v":0},{"$f":"Tenant!$B7","v":0},{"$f":"Tenant!$C7","v":0},{"$f":"Tenant!$D7","v":0},{"$f":"Tenant!$E7","v":0},{"$f":"Tenant!$G7","v":0},{"$f":"Usage!$D7","v":"00:00:00"},{"$f":"Usage!$E7","v":"00:00:00"},{"$f":"Usage!$F7","v":0},{"$f":"Usage!$G7","v":0},{"$f":"Usage!$H7","v":0},{"$f":"Usage!$L7","v":0},{"$f":"Account!$AI$2","v":0},{"$f":"Usage!$N7","v":0},{"$f":"Usage!$M7","v":0},{"$f":"Account!$AH$2","v":0},{"$f":"Usage!$O7","v":0},0,{"$f":"Tenant!$H7","v":0},{"$f":"Account!$Y$2/100","v":0},{"$f":"Usage!$R7","v":0},{"$f":"Account!$X$2/100","v":0},{"$f":"Usage!$S7","v":0},{"$f":"Tenant!$I7","v":0},{"$f":"Usage!$V7","v":0},{"$f":"Account!$AB$2","v":0},{"$f":"Usage!$X7","v":0},{"$f":"Usage!$W7","v":0},{"$f":"Account!$AA$2","v":0},{"$f":"Usage!$Y7","v":0},{"$f":"Usage!$Z7","v":0},0]
[{"$f":"Tenant!$A8","v":7},{"$f":"Account!$C$2","v":0},{"$f":"Account!$I$2","v":0},{"$f":"Tenant!$B8","v":0},{"$f":"Tenant!$C8","v":0},{"$f":"Tenant!$D8","v":0},{"$f":"Tenant!$E8","v":0},{"$f":"Tenant!$G8","v":0},{"$f":"Usage!$D8","v":"00:00:00"},{"$f":"Usage!$E8","v":"00:00:00"},{"$f":"Usage!$F8","v":0},{"$f":"Usage!$G8","v":0},{"$f":"Usage!$H8","v":0},{"$f":"Usage!$L8","v":0},{"$f":"Account!$AI$2","v":0},{"$f":"Usage!$N8","v":0},{"$f":"Usage!$M8","v":0},{"$f":"Account!$AH$2","v":0},{"$f":"Usage!$O8","v":0},0,{"$f":"Tenant!$H8","v":0},{"$f":"Account!$Y$2/100","v":0},{"$f":"Usage!$R8","v":0},{"$f":"Account!$X$2/100","v":0},{"$f":"Usage!$S8","v":0},{"$f":"Tenant!$I8","v":0},{"$f":"Usage!$V8","v":0},{"$f":"Account!$AB$2","v":0},{"$f":"Usage!$X8","v":0},{"$f":"Usage!$W8","v":0},{"$f":"Account!$AA$2","v":0},{"$f":"Usage!$Y8","v":0},{"$f":"Usage!$Z8","v":0},0]
[{"$f":"Tenant!$A9","v":8},{"$f":"Account!$C$2","v":0},{"$f":"Account!$I$2","v":0},{"$f":"Tenant!$B9","v":0},{"$f":"Tenant!$C9","v":0},{"$f":"Tenant!$D9","v":0},{"$f":"Tenant!$E9","v":0},{"$f":"Tenant!$G9","v":0},{"$f":"Usage!$D9","v":"00:00:00"},{"$f":"Usage!$E9","v":"00:00:00"},{"$f":"Usage!$F9","v":0},{"$f":"Usage!$G9","v":0},{"$f":"Usage!$H9","v":0},{"$f":"Usage!$L9","v":0},{"$f":"Account!$AI$2","v":0},{"$f":"Usage!$N9","v":0},{"$f":"Usage!$M9","v":0},{"$f":"Account!$AH$2","v":0},{"$f":"Usage!$O9","v":0},0,{"$f":"Tenant!$H9","v":0},{"$f":"Account!$Y$2/100","v":0},{"$f":"Usage!$R9","v":0},{"$f":"Account!$X$2/100","v":0},{"$f":"Usage!$S9","v":0},{"$f":"Tenant!$I9","v":0},{"$f":"Usage!$V9","v":0},{"$f":"Account!$AB$2","v":0},{"$f":"Usage!$X9","v":0},{"$f":"Usage!$W9","v":0},{"$f":"Account!$AA$2","v":0},{"$f":"Usage!$Y9","v":0},{"$f":"Usage!$Z9","v":0},0]
[{"$f":"Tenant!$A10","v":9},{"$f":"Account!$C$2","v":0},{"$f":"Account!$I$2","v":0},{"$f":"Tenant!$B10","v":0},{"$f":"Tenant!$C10","v":0},{"$f":"Tenant!$D10","v":0},{"$f":"Tenant!$E10","v":0},{"$f":"Tenant!$G10","v":0},{"$f":"Usage!$D10","v":"00:00:00"},{"$f":"Usage!$E10","v":"00:00:00"},{"$f":"Usage!$F10","v":0},{"$f":"Usage!$G10","v":0},{"$f":"Usage!$H10","v":0},{"$f":"Usage!$L10","v":0},{"$f":"Account!$AI$2","v":0},{"$f":"Usage!$N10","v":0},{"$f":"Usage!$M10","v":0},{"$f":"Account!$AH$2","v":0},{"$f":"Usage!$O10","v":0},0,{"$f":"Tenant!$H10","v":0},{"$f":"Account!$Y$2/100","v":0},{"$f":"Usage!$R10","v":0},{"$f":"Account!$X$2/100","v":0},{"$f":"Usage!$S10","v":0},{"$f":"Tenant!$I10","v":0},{"$f":"Usage!$V10","v":0},{"$f":"Account!$AB$2","v":0},{"$f":"Usage!$X10","v":0},{"$f":"Usage!$W10","v":0},{"$f":"Account!$AA$2","v":0},{"$f":"Usage!$Y10","v":0},{"$f":"Usage!$Z10","v":0},0]
[{"$f":"Tenant!$A11","v":10},{"$f":"Account!$C$2","v":0},{"$f":"Account!$I$2","v":0},{"$f":"Tenant!$B11","v":0},{"$f":"Tenant!$C11","v":0},{"$f":"Tenant!$D11","v":0},{"$f":"Tenant!$E11","v":0},{"$f":"Tenant!$G11","v":0},{"$f":"Usage!$D11","v":"00:00:00"},{"$f":"Usage!$E11","v":"00:00:00"},{"$f":"Usage!$F11","v":0},{"$f":"Usage!$G11","v":0},{"$f":"Usage!$H11","v":0},{"$f":"Usage!$L11","v":0},{"$f":"Account!$AI$2","v":0},{"$f":"Usage!$N11","v":0},{"$f":"Usage!$M11","v":0},{"$f":"Account!$AH$2","v":0},{"$f":"Usage!$O11","v":0},0,{"$f":"Tenant!$H11","v":0},{"$f":"Account!$Y$2/100","v":0},{"$f":"Usage!$R11","v":0},{"$f":"Account!$X$2/100","v":0},{"$f":"Usage!$S11","v":0},{"$f":"Tenant!$I11","v":0},{"$f":"Usage!$V11","v":0},{"$f":"Account!$AB$2","v":0},{"$f":"Usage!$X11","v":0},{"$f":"Usage!$W11","v":0},{"$f":"Account!$AA$2","v":0},{"$f":"Usage!$Y11","v":0},{"$f":"Usage!$Z11","v":0},0]
[{"$f":"Tenant!$A12","v":11},{"$f":"Account!$C$2","v":0},{"$f":"Account!$I$2","v":0},{"$f":"Tenant!$B12","v":0},{"$f":"Tenant!$C12","v":0},{"$f":"Tenant!$D12","v":0},{"$f":"Tenant!$E12","v":0},{"$f":"Tenant!$G12","v":0},{"$f":"Usage!$D12","v":"00:00:00"},{"$f":"Usage!$E12","v":"00:00:00"},{"$f":"Usage!$F12","v":0},{"$f":"Usage!$G12","v":0},{"$f":"Usage!$H12","v":0},{"$f":"Usage!$L12","v":0},{"$f":"Account!$AI$2","v":0},{"$f":"Usage!$N12","v":0},{"$f":"Usage!$M12","v":0},{"$f":"Account!$AH$2","v":0},{"$f":"Usage!$O12","v":0},0,{"$f":"Tenant!$H12","v":0},{"$f":"Account!$Y$2/100","v":0},{"$f":"Usage!$R12","v":0},{"$f":"Account!$X$2/100","v":0},{"$f":"Usage!$S12","v":0},{"$f":"Tenant!$I12","v":0},{"$f":"Usage!$V12","v":0},{"$f":"Account!$AB$2","v":0},{"$f":"Usage!$X12","v":0},{"$f":"Usage!$W12","v":0},{"$f":"Account!$AA$2","v":0},{"$f":"Usage!$Y12","v":0},{"$f":"Usage!$Z12","v":0},0]
[{"$f":"Tenant!$A13","v":12},{"$f":"Account!$C$2","v":0},{"$f":"Account!$I$2","v":0},{"$f":"Tenant!$B13","v":0},{"$f":"Tenant!$C13","v":0},{"$f":"Tenant!$D13","v":0},{"$f":"Tenant!$E13","v":0},{"$f":"Tenant!$G13","v":0},{"$f":"Usage!$D13","v":"00:00:00"},{"$f":"Usage!$E13","v":"00:00:00"},{"$f":"Usage!$F13","v":0},{"$f":"Usage!$G13","v":0},{"$f":"Usage!$H13","v":0},{"$f":"Usage!$L13","v":0},{"$f":"Account!$AI$2","v":0},{"$f":"Usage!$N13","v":0},{"$f":"Usage!$M13","v":0},{"$f":"Account!$AH$2","v":0},{"$f":"Usage!$O13","v":0},0,{"$f":"Tenant!$H13","v":0},{"$f":"Account!$Y$2/100","v":0},{"$f":"Usage!$R13","v":0},{"$f":"Account!$X$2/100","v":0},{"$f":"Usage!$S13","v":0},{"$f":"Tenant!$I13","v":0},{"$f":"Usage!$V13","v":0},{"$f":"Account!$AB$2","v":0},{"$f":"Usage!$X13","v":0},{"$f":"Usage!$W13","v":0},{"$f":"Account!$AA$2","v":0},{"$f":"Usage!$Y13","v":0},{"$f":"Usage!$Z13","v":0},0]
[{"$f":"Tenant!$A14","v":13},{"$f":"Account!$C$2","v":0},{"$f":"Account!$I$2","v":0},{"$f":"Tenant!$B14","v":0},{"$f":"Tenant!$C14","v":0},{"$f":"Tenant!$D14","v":0},{"$f":"Tenant!$E14","v":0},{"$f":"Tenant!$G14","v":0},{"$f":"Usage!$D14","v":"00:00:00"},{"$f":"Usage!$E14","v":"00:00:00"},{"$f":"Usage!$F14","v":0},{"$f":"Usage!$G14","v":0},{"$f":"Usage!$H14","v":0},{"$f":"Usage!$L14","v":0},{"$f":"Account!$AI$2","v":0},{"$f":"Usage!$N14","v":0},{"$f":"Usage!$M14","v":0},{"$f":"Account!$AH$2","v":0},{"$f":"Usage!$O14","v":0},0,{"$f":"Tenant!$H14","v":0},{"$f":"Account!$Y$2/100","v":0},{"$f":"Usage!$R14","v":0},{"$f":"Account!$X$2/100","v":0},{"$f":"Usage!$S14","v":0},{"$f":"Tenant!$I14","v":0},{"$f":"Usage!$V14","v":0},{"$f":"Account!$AB$2","v":0},{"$f":"Usage!$X14","v":0},{"$f":"Usage!$W14","v":0},{"$f":"Account!$AA$2","v":0},{"$f":"Usage!$Y14","v":0},{"$f":"Usage!$Z14","v":0},0]
[{"$f":"Tenant!$A15","v":14},{"$f":"Account!$C$2","v":0},{"$f":"Account!$I$2","v":0},{"$f":"Tenant!$B15","v":0},{"$f":"Tenant!$C15","v":0},{"$f":"Tenant!$D15","v":0},{"$f":"Tenant!$E15","v":0},{"$f":"Tenant!$G15","v":0},{"$f":"Usage!$D15","v":"00:00:00"},{"$f":"Usage!$E15","v":"00:00:00"},{"$f":"Usage!$F15","v":0},{"$f":"Usage!$G15","v":0},{"$f":"Usage!$H15","v":0},{"$f":"Usage!$L15","v":0},{"$f":"Account!$AI$2","v":0},{"$f":"Usage!$N15","v":0},{"$f":"Usage!$M15","v":0},{"$f":"Account!$AH$2","v":0},{"$f":"Usage!$O15","v":0},0,{"$f":"Tenant!$H15","v":0},{"$f":"Account!$Y$2/100","v":0},{"$f":"Usage!$R15","v":0},{"$f":"Account!$X$2/100","v":0},{"$f":"Usage!$S15","v":0},{"$f":"Tenant!$I15","v":0},{"$f":"Usage!$V15","v":0},{"$f":"Account!$AB$2","v":0},{"$f":"Usage!$X15","v":0},{"$f":"Usage!$W15","v":0},{"$f":"Account!$AA$2","v":0},{"$f":"Usage!$Y15","v":0},{"$f":"Usage!$Z15","v":0},0]
[{"$f":"Tenant!$A16","v":15},{"$f":"Account!$C$2","v":0},{"$f":"Account!$I$2","v":0},{"$f":"Tenant!$B16","v":0},{"$f":"Tenant!$C16","v":0},{"$f":"Tenant!$D16","v":0},{"$f":"Tenant!$E16","v":0},{"$f":"Tenant!$G16","v":0},{"$f":"Usage!$D16","v":"00:00:00"},{"$f":"Usage!$E16","v":"00:00:00"},{"$f":"Usage!$F16","v":0},{"$f":"Usage!$G16","v":0},{"$f":"Usage!$H16","v":0},{"$f":"Usage!$L16","v":0},{"$f":"Account!$AI$2","v":0},{"$f":"Usage!$N16","v":0},{"$f":"Usage!$M16","v":0},{"$f":"Account!$AH$2","v":0},{"$f":"Usage!$O16","v":0},0,{"$f":"Tenant!$H16","v":0},{"$f":"Account!$Y$2/100","v":0},{"$f":"Usage!$R16","v":0},{"$f":"Account!$X$2/100","v":0},{"$f":"Usage!$S16","v":0},{"$f":"Tenant!$I16","v":0},{"$f":"Usage!$V16","v":0},{"$f":"Account!$AB$2","v":0},{"$f":"Usage!$X16","v":0},{"$f":"Usage!$W16","v":0},{"$f":"Account!$AA$2","v":0},{"$f":"Usage!$Y16","v":0},{"$f":"Usage!$Z16","v":0},0]
[{"$f":"Tenant!$A17","v":16},{"$f":"Account!$C$2","v":0},{"$f":"Account!$I$2","v":0},{"$f":"Tenant!$B17","v":0},{"$f":"Tenant!$C17","v":0},{"$f":"Tenant!$D17","v":0},{"$f":"Tenant!$E17","v":0},{"$f":"Tenant!$G17","v":0},{"$f":"Usage!$D17","v":"00:00:00"},{"$f":"Usage!$E17","v":"00:00:00"},{"$f":"Usage!$F17","v":0},{"$f":"Usage!$G17","v":0},{"$f":"Usage!$H17","v":0},{"$f":"Usage!$L17","v":0},{"$f":"Account!$AI$2","v":0},{"$f":"Usage!$N17","v":0},{"$f":"Usage!$M17","v":0},{"$f":"Account!$AH$2","v":0},{"$f":"Usage!$O17","v":0},0,{"$f":"Tenant!$H17","v":0},{"$f":"Account!$Y$2/100","v":0},{"$f":"Usage!$R17","v":0},{"$f":"Account!$X$2/100","v":0},{"$f":"Usage!$S17","v":0},{"$f":"Tenant!$I17","v":0},{"$f":"Usage!$V17","v":0},{"$f":"Account!$AB$2","v":0},{"$f":"Usage!$X17","v":0},{"$f":"Usage!$W17","v":0},{"$f":"Account!$AA$2","v":0},{"$f":"Usage!$Y17","v":0},{"$f":"Usage!$Z17","v":0},0]
[{"$f":"Tenant!$A18","v":17},{"$f":"Account!$C$2","v":0},{"$f":"Account!$I$2","v":0},{"$f":"Tenant!$B18","v":0},{"$f":"Tenant!$C18","v":0},{"$f":"Tenant!$D18","v":0},{"$f":"Tenant!$E18","v":0},{"$f":"Tenant!$G18","v":0},{"$f":"Usage!$D18","v":"00:00:00"},{"$f":"Usage!$E18","v":"00:00:00"},{"$f":"Usage!$F18","v":0},{"$f":"Usage!$G18","v":0},{"$f":"Usage!$H18","v":0},{"$f":"Usage!$L18","v":0},{"$f":"Account!$AI$2","v":0},{"$f":"Usage!$N18","v":0},{"$f":"Usage!$M18","v":0},{"$f":"Account!$AH$2","v":0},{"$f":"Usage!$O18","v":0},0,{"$f":"Tenant!$H18","v":0},{"$f":"Account!$Y$2/100","v":0},{"$f":"Usage!$R18","v":0},{"$f":"Account!$X$2/100","v":0},{"$f":"Usage!$S18","v":0},{"$f":"Tenant!$I18","v":0},{"$f":"Usage!$V18","v":0},{"$f":"Account!$AB$2","v":0},{"$f":"Usage!$X18","v":0},{"$f":"Usage!$W18","v":0},{"$f":"Account!$AA$2","v":0},{"$f":"Usage!$Y18","v":0},{"$f":"Usage!$Z18","v":0},0]
[{"$f":"Tenant!$A19","v":18},{"$f":"Account!$C$2","v":0},{"$f":"Account!$I$2","v":0},{"$f":"Tenant!$B19","v":0},{"$f":"Tenant!$C19","v":0},{"$f":"Tenant!$D19","v":0},{"$f":"Tenant!$E19","v":0},{"$f":"Tenant!$G19","v":0},{"$f":"Usage!$D19","v":"00:00:00"},{"$f":"Usage!$E19","v":"00:00:00"},{"$f":"Usage!$F19","v":0},{"$f":"Usage!$G19","v":0},{"$f":"Usage!$H19","v":0},{"$f":"Usage!$L19","v":0},{"$f":"Account!$AI$2","v":0},{"$f":"Usage!$N19","v":0},{"$f":"Usage!$M19","v":0},{"$f":"Account!$AH$2","v":0},{"$f":"Usage!$O19","v":0},0,{"$f":"Tenant!$H19","v":0},{"$f":"Account!$Y$2/100","v":0},{"$f":"Usage!$R19","v":0},{"$f":"Account!$X$2/100","v":0},{"$f":"Usage!$S19","v":0},{"$f":"Tenant!$I19","v":0},{"$f":"Usage!$V19","v":0},{"$f":"Account!$AB$2","v":0},{"$f":"Usage!$X19","v":0},{"$f":"Usage!$W19","v":0},{"$f":"Account!$AA$2","v":0},{"$f":"Usage!$Y19","v":0},{"$f":"Usage!$Z19","v":0},0]
[{"$f":"Tenant!$A20","v":19},{"$f":"Account!$C$2","v":0},{"$f":"Account!$I$2","v":0},{"$f":"Tenant!$B20","v":0},{"$f":"Tenant!$C20","v":0},{"$f":"Tenant!$D20","v":0},{"$f":"Tenant!$E20","v":0},{"$f":"Tenant!$G20","v":0},{"$f":"Usage!$D20","v":"00:00:00"},{"$f":"Usage!$E20","v":"00:00:00"},{"$f":"Usage!$F20","v":0},{"$f":"Usage!$G20","v":0},{"$f":"Usage!$H20","v":0},{"$f":"Usage!$L20","v":0},{"$f":"Account!$AI$2","v":0},{"$f":"Usage!$N20","v":0},{"$f":"Usage!$M20","v":0},{"$f":"Account!$AH$2","v":0},{"$f":"Usage!$O20","v":0},0,{"$f":"Tenant!$H20","v":0},{"$f":"Account!$Y$2/100","v":0},{"$f":"Usage!$R20","v":0},{"$f":"Account!$X$2/100","v":0},{"$f":"Usage!$S20","v":0},{"$f":"Tenant!$I20","v":0},{"$f":"Usage!$V20","v":0},{"$f":"Account!$AB$2","v":0},{"$f":"Usage!$X20","v":0},{"$f":"Usage!$W20","v":0},{"$f":"Account!$AA$2","v":0},{"$f":"Usage!$Y20","v":0},{"$f":"Usage!$Z20","v":0},0]
[{"$f":"Tenant!$A21","v":20},{"$f":"Account!$C$2","v":0},{"$f":"Account!$I$2","v":0},{"$f":"Tenant!$B21","v":0},{"$f":"Tenant!$C21","v":0},{"$f":"Tenant!$D21","v":0},{"$f":"Tenant!$E21","v":0},{"$f":"Tenant!$G21","v":0},{"$f":"Usage!$D21","v":"00:00:00"},{"$f":"Usage!$E21","v":"00:00:00"},{"$f":"Usage!$F21","v":0},{"$f":"Usage!$G21","v":0},{"$f":"Usage!$H21","v":0},{"$f":"Usage!$L21","v":0},{"$f":"Account!$AI$2","v":0},{"$f":"Usage!$N21","v":0},{"$f":"Usage!$M21","v":0},{"$f":"Account!$AH$2","v":0},{"$f":"Usage!$O21","v":0},0,{"$f":"Tenant!$H21","v":0},{"$f":"Account!$Y$2/100","v":0},{"$f":"Usage!$R21","v":0},{"$f":"Account!$X$2/100","v":0},{"$f":"Usage!$S21","v":0},{"$f":"Tenant!$I21","v":0},{"$f":"Usage!$V21","v":0},{"$f":"Account!$AB$2","v":0},{"$f":"Usage!$X21","v":0},{"$f":"Usage!$W21","v":0},{"$f":"Account!$AA$2","v":0},{"$f":"Usage!$Y21","v":0},{"$f":"Usage!$Z21","v":0},0]
[{"$f":"Tenant!$A22","v":21},{"$f":"Account!$C$2","v":0},{"$f":"Account!$I$2","v":0},{"$f":"Tenant!$B22","v":0},{"$f":"Tenant!$C22","v":0},{"$f":"Tenant!$D22","v":0},{"$f":"Tenant!$E22","v":0},{"$f":"Tenant!$G22","v":0},{"$f":"Usage!$D22","v":"00:00:00"},{"$f":"Usage!$E22","v":"00:00:00"},{"$f":"Usage!$F22","v":0},{"$f":"Usage!$G22","v":0},{"$f":"Usage!$H22","v":0},{"$f":"Usage!$L22","v":0},{"$f":"Account!$AI$2","v":0},{"$f":"Usage!$N22","v":0},{"$f":"Usage!$M22","v":0},{"$f":"Account!$AH$2","v":0},{"$f":"Usage!$O22","v":0},0,{"$f":"Tenant!$H22","v":0},{"$f":"Account!$Y$2/100","v":0},{"$f":"Usage!$R22","v":0},{"$f":"Account!$X$2/100","v":0},{"$f":"Usage!$S22","v":0},{"$f":"Tenant!$I22","v":0},{"$f":"Usage!$V22","v":0},{"$f":"Account!$AB$2","v":0},{"$f":"Usage!$X22","v":0},{"$f":"Usage!$W22","v":0},{"$f":"Account!$AA$2","v":0},{"$f":"Usage!$Y22","v":0},{"$f":"Usage!$Z22","v":0},0]
[{"$f":"Tenant!$A23","v":22},{"$f":"Account!$C$2","v":0},{"$f":"Account!$I$2","v":0},{"$f":"Tenant!$B23","v":0},{"$f":"Tenant!$C23","v":0},{"$f":"Tenant!$D23","v":0},{"$f":"Tenant!$E23","v":0},{"$f":"Tenant!$G23","v":0},{"$f":"Usage!$D23","v":"00:00:00"},{"$f":"Usage!$E23","v":"00:00:00"},{"$f":"Usage!$F23","v":0},{"$f":"Usage!$G23","v":0},{"$f":"Usage!$H23","v":0},{"$f":"Usage!$L23","v":0},{"$f":"Account!$AI$2","v":0},{"$f":"Usage!$N23","v":0},{"$f":"Usage!$M23","v":0},{"$f":"Account!$AH$2","v":0},{"$f":"Usage!$O23","v":0},0,{"$f":"Tenant!$H23","v":0},{"$f":"Account!$Y$2/100","v":0},{"$f":"Usage!$R23","v":0},{"$f":"Account!$X$2/100","v":0},{"$f":"Usage!$S23","v":0},{"$f":"Tenant!$I23","v":0},{"$f":"Usage!$V23","v":0},{"$f":"Account!$AB$2","v":0},{"$f":"Usage!$X23","v":0},{"$f":"Usage!$W23","v":0},{"$f":"Account!$AA$2","v":0},{"$f":"Usage!$Y23","v":0},{"$f":"Usage!$Z23","v":0},0]
[{"$f":"Tenant!$A24","v":23},{"$f":"Account!$C$2","v":0},{"$f":"Account!$I$2","v":0},{"$f":"Tenant!$B24","v":0},{"$f":"Tenant!$C24","v":0},{"$f":"Tenant!$D24","v":0},{"$f":"Tenant!$E24","v":0},{"$f":"Tenant!$G24","v":0},{"$f":"Usage!$D24","v":"00:00:00"},{"$f":"Usage!$E24","v":"00:00:00"},{"$f":"Usage!$F24","v":0},{"$f":"Usage!$G24","v":0},{"$f":"Usage!$H24","v":0},{"$f":"Usage!$L24","v":0},{"$f":"Account!$AI$2","v":0},{"$f":"Usage!$N24","v":0},{"$f":"Usage!$M24","v":0},{"$f":"Account!$AH$2","v":0},{"$f":"Usage!$O24","v":0},0,{"$f":"Tenant!$H24","v":0},{"$f":"Account!$Y$2/100","v":0},{"$f":"Usage!$R24","v":0},{"$f":"Account!$X$2/100","v":0},{"$f":"Usage!$S24","v":0},{"$f":"Tenant!$I24","v":0},{"$f":"Usage!$V24","v":0},{"$f":"Account!$AB$2","v":0},{"$f":"Usage!$X24","v":0},{"$f":"Usage!$W24","v":0},{"$f":"Account!$AA$2","v":0},{"$f":"Usage!$Y24","v":0},{"$f":"Usage!$Z24","v":0},0]
[{"$f":"Tenant!$A25","v":24},{"$f":"Account!$C$2","v":0},{"$f":"Account!$I$2","v":0},{"$f":"Tenant!$B25","v":0},{"$f":"Tenant!$C25","v":0},{"$f":"Tenant!$D25","v":0},{"$f":"Tenant!$E25","v":0},{"$f":"Tenant!$G25","v":0},{"$f":"Usage!$D25","v":"00:00:00"},{"$f":"Usage!$E25","v":"00:00:00"},{"$f":"Usage!$F25","v":0},{"$f":"Usage!$G25","v":0},{"$f":"Usage!$H25","v":0},{"$f":"Usage!$L25","v":0},{"$f":"Account!$AI$2","v":0},{"$f":"Usage!$N25","v":0},{"$f":"Usage!$M25","v":0},{"$f":"Account!$AH$2","v":0},{"$f":"Usage!$O25","v":0},0,{"$f":"Tenant!$H25","v":0},{"$f":"Account!$Y$2/100","v":0},{"$f":"Usage!$R25","v":0},{"$f":"Account!$X$2/100","v":0},{"$f":"Usage!$S25","v":0},{"$f":"Tenant!$I25","v":0},{"$f":"Usage!$V25","v":0},{"$f":"Account!$AB$2","v":0},{"$f":"Usage!$X25","v":0},{"$f":"Usage!$W25","v":0},{"$f":"Account!$AA$2","v":0},{"$f":"Usage!$Y25","v":0},{"$f":"Usage!$Z25","v":0},0]
[{"$f":"Tenant!$A26","v":25},{"$f":"Account!$C$2","v":0},{"$f":"Account!$I$2","v":0},{"$f":"Tenant!$B26","v":0},{"$f":"Tenant!$C26","v":0},{"$f":"Tenant!$D26","v":0},{"$f":"Tenant!$E26","v":0},{"$f":"Tenant!$G26","v":0},{"$f":"Usage!$D26","v":"00:00:00"},{"$f":"Usage!$E26","v":"00:00:00"},{"$f":"Usage!$F26","v":0},{"$f":"Usage!$G26","v":0},{"$f":"Usage!$H26","v":0},{"$f":"Usage!$L26","v":0},{"$f":"Account!$AI$2","v":0},{"$f":"Usage!$N26","v":0},{"$f":"Usage!$M26","v":0},{"$f":"Account!$AH$2","v":0},{"$f":"Usage!$O26","v":0},0,{"$f":"Tenant!$H26","v":0},{"$f":"Account!$Y$2/100","v":0},{"$f":"Usage!$R26","v":0},{"$f":"Account!$X$2/100","v":0},{"$f":"Usage!$S26","v":0},{"$f":"Tenant!$I26","v":0},{"$f":"Usage!$V26","v":0},{"$f":"Account!$AB$2","v":0},{"$f":"Usage!$X26","v":0},{"$f":"Usage!$W26","v":0},{"$f":"Account!$AA$2","v":0},{"$f":"Usage!$Y26","v":0},{"$f":"Usage!$Z26","v":0},0]
[{"$f":"Tenant!$A27","v":26},{"$f":"Account!$C$2","v":0},{"$f":"Account!$I$2","v":0},{"$f":"Tenant!$B27","v":0},{"$f":"Tenant!$C27","v":0},{"$f":"Tenant!$D27","v":0},{"$f":"Tenant!$E27","v":0},{"$f":"Tenant!$G27","v":0},{"$f":"Usage!$D27","v":"00:00:00"},{"$f":"Usage!$E27","v":"00:00:00"},{"$f":"Usage!$F27","v":0},{"$f":"Usage!$G27","v":0},{"$f":"Usage!$H27","v":0},{"$f":"Usage!$L27","v":0},{"$f":"Account!$AI$2","v":0},{"$f":"Usage!$N27","v":0},{"$f":"Usage!$M27","v":0},{"$f":"Account!$AH$2","v":0},{"$f":"Usage!$O27","v":0},0,{"$f":"Tenant!$H27","v":0},{"$f":"Account!$Y$2/100","v":0},{"$f":"Usage!$R27","v":0},{"$f":"Account!$X$2/100","v":0},{"$f":"Usage!$S27","v":0},{"$f":"Tenant!$I27","v":0},{"$f":"Usage!$V27","v":0},{"$f":"Account!$AB$2","v":0},{"$f":"Usage!$X27","v":0},{"$f":"Usage!$W27","v":0},{"$f":"Account!$AA$2","v":0},{"$f":"Usage!$Y27","v":0},{"$f":"Usage!$Z27","v":0},0]
[{"$f":"Tenant!$A28","v":27},{"$f":"Account!$C$2","v":0},{"$f":"Account!$I$2","v":0},{"$f":"Tenant!$B28","v":0},{"$f":"Tenant!$C28","v":0},{"$f":"Tenant!$D28","v":0},{"$f":"Tenant!$E28","v":0},{"$f":"Tenant!$G28","v":0},{"$f":"Usage!$D28","v":"00:00:00"},{"$f":"Usage!$E28","v":"00:00:00"},{"$f":"Usage!$F28","v":0},{"$f":"Usage!$G28","v":0},{"$f":"Usage!$H28","v":0},{"$f":"Usage!$L28","v":0},{"$f":"Account!$AI$2","v":0},{"$f":"Usage!$N28","v":0},{"$f":"Usage!$M28","v":0},{"$f":"Account!$AH$2","v":0},{"$f":"Usage!$O28","v":0},0,{"$f":"Tenant!$H28","v":0},{"$f":"Account!$Y$2/100","v":0},{"$f":"Usage!$R28","v":0},{"$f":"Account!$X$2/100","v":0},{"$f":"Usage!$S28","v":0},{"$f":"Tenant!$I28","v":0},{"$f":"Usage!$V28","v":0},{"$f":"Account!$AB$2","v":0},{"$f":"Usage!$X28","v":0},{"$f":"Usage!$W28","v":0},{"$f":"Account!$AA$2","v":0},{"$f":"Usage!$Y28","v":0},{"$f":"Usage!$Z28","v":0},0]
[{"$f":"Tenant!$A29","v":28},{"$f":"Account!$C$2","v":0},{"$f":"Account!$I$2","v":0},{"$f":"Tenant!$B29","v":0},{"$f":"Tenant!$C29","v":0},{"$f":"Tenant!$D29","v":0},{"$f":"Tenant!$E29","v":0},{"$f":"Tenant!$G29","v":0},{"$f":"Usage!$D29","v":"00:00:00"},{"$f":"Usage!$E29","v":"00:00:00"},{"$f":"Usage!$F29","v":0},{"$f":"Usage!$G29","v":0},{"$f":"Usage!$H29","v":0},{"$f":"Usage!$L29","v":0},{"$f":"Account!$AI$2","v":0},{"$f":"Usage!$N29","v":0},{"$f":"Usage!$M29","v":0},{"$f":"Account!$AH$2","v":0},{"$f":"Usage!$O29","v":0},0,{"$f":"Tenant!$H29","v":0},{"$f":"Account!$Y$2/100","v":0},{"$f":"Usage!$R29","v":0},{"$f":"Account!$X$2/100","v":0},{"$f":"Usage!$S29","v":0},{"$f":"Tenant!$I29","v":0},{"$f":"Usage!$V29","v":0},{"$f":"Account!$AB$2","v":0},{"$f":"Usage!$X29","v":0},{"$f":"Usage!$W29","v":0},{"$f":"Account!$AA$2","v":0},{"$f":"Usage!$Y29","v":0},{"$f":"Usage!$Z29","v":0},0]
[{"$f":"Tenant!$A30","v":29},{"$f":"Account!$C$2","v":0},{"$f":"Account!$I$2","v":0},{"$f":"Tenant!$B30","v":0},{"$f":"Tenant!$C30","v":0},{"$f":"Tenant!$D30","v":0},{"$f":"Tenant!$E30","v":0},{"$f":"Tenant!$G30","v":0},{"$f":"Usage!$D30","v":"00:00:00"},{"$f":"Usage!$E30","v":"00:00:00"},{"$f":"Usage!$F30","v":0},{"$f":"Usage!$G30","v":0},{"$f":"Usage!$H30","v":0},{"$f":"Usage!$L30","v":0},{"$f":"Account!$AI$2","v":0},{"$f":"Usage!$N30","v":0},{"$f":"Usage!$M30","v":0},{"$f":"Account!$AH$2","v":0},{"$f":"Usage!$O30","v":0},0,{"$f":"Tenant!$H30","v":0},{"$f":"Account!$Y$2/100","v":0},{"$f":"Usage!$R30","v":0},{"$f":"Account!$X$2/100","v":0},{"$f":"Usage!$S30","v":0},{"$f":"Tenant!$I30","v":0},{"$f":"Usage!$V30","v":0},{"$f":"Account!$AB$2","v":0},{"$f":"Usage!$X30","v":0},{"$f":"Usage!$W30","v":0},{"$f":"Account!$AA$2","v":0},{"$f":"Usage!$Y30","v":0},{"$f":"Usage!$Z30","v":0},0]
[{"$f":"Tenant!$A31","v":30},{"$f":"Account!$C$2","v":0},{"$f":"Account!$I$2","v":0},{"$f":"Tenant!$B31","v":0},{"$f":"Tenant!$C31","v":0},{"$f":"Tenant!$D31","v":0},{"$f":"Tenant!$E31","v":0},{"$f":"Tenant!$G31","v":0},{"$f":"Usage!$D31","v":"00:00:00"},{"$f":"Usage!$E31","v":"00:00:00"},{"$f":"Usage!$F31","v":0},{"$f":"Usage!$G31","v":0},{"$f":"Usage!$H31","v":0},{"$f":"Usage!$L31","v":0},{"$f":"Account!$AI$2","v":0},{"$f":"Usage!$N31","v":0},{"$f":"Usage!$M31","v":0},{"$f":"Account!$AH$2","v":0},{"$f":"Usage!$O31","v":0},0,{"$f":"Tenant!$H31","v":0},{"$f":"Account!$Y$2/100","v":0},{"$f":"Usage!$R31","v":0},{"$f":"Account!$X$2/100","v":0},{"$f":"Usage!$S31","v":0},{"$f":"Tenant!$I31","v":0},{"$f":"Usage!$V31","v":0},{"$f":"Account!$AB$2","v":0},{"$f":"Usage!$X31","v":0},{"$f":"Usage!$W31","v":0},{"$f":"Account!$AA$2","v":0},{"$f":"Usage!$Y31","v":0},{"$f":"Usage!$Z31","v":0},0]
[{"$f":"Tenant!$A32","v":31},{"$f":"Account!$C$2","v":0},{"$f":"Account!$I$2","v":0},{"$f":"Tenant!$B32","v":0},{"$f":"Tenant!$C32","v":0},{"$f":"Tenant!$D32","v":0},{"$f":"Tenant!$E32","v":0},{"$f":"Tenant!$G32","v":0},{"$f":"Usage!$D32","v":"00:00:00"},{"$f":"Usage!$E32","v":"00:00:00"},{"$f":"Usage!$F32","v":0},{"$f":"Usage!$G32","v":0},{"$f":"Usage!$H32","v":0},{"$f":"Usage!$L32","v":0},{"$f":"Account!$AI$2","v":0},{"$f":"Usage!$N32","v":0},{"$f":"Usage!$M32","v":0},{"$f":"Account!$AH$2","v":0},{"$f":"Usage!$O32","v":0},0,{"$f":"Tenant!$H32","v":0},{"$f":"Account!$Y$2/100","v":0},{"$f":"Usage!$R32","v":0},{"$f":"Account!$X$2/100","v":0},{"$f":"Usage!$S32","v":0},{"$f":"Tenant!$I32","v":0},{"$f":"Usage!$V32","v":0},{"$f":"Account!$AB$2","v":0},{"$f":"Usage!$X32","v":0},{"$f":"Usage!$W32","v":0},{"$f":"Account!$AA$2","v":0},{"$f":"Usage!$Y32","v":0},{"$f":"Usage!$Z32","v":0},0]
[{"$f":"Tenant!$A33","v":32},{"$f":"Account!$C$2","v":0},{"$f":"Account!$I$2","v":0},{"$f":"Tenant!$B33","v":0},{"$f":"Tenant!$C33","v":0},{"$f":"Tenant!$D33","v":0},{"$f":"Tenant!$E33","v":0},{"$f":"Tenant!$G33","v":0},{"$f":"Usage!$D33","v":"00:00:00"},{"$f":"Usage!$E33","v":"00:00:00"},{"$f":"Usage!$F33","v":0},{"$f":"Usage!$G33","v":0},{"$f":"Usage!$H33","v":0},{"$f":"Usage!$L33","v":0},{"$f":"Account!$AI$2","v":0},{"$f":"Usage!$N33","v":0},{"$f":"Usage!$M33","v":0},{"$f":"Account!$AH$2","v":0},{"$f":"Usage!$O33","v":0},0,{"$f":"Tenant!$H33","v":0},{"$f":"Account!$Y$2/100","v":0},{"$f":"Usage!$R33","v":0},{"$f":"Account!$X$2/100","v":0},{"$f":"Usage!$S33","v":0},{"$f":"Tenant!$I33","v":0},{"$f":"Usage!$V33","v":0},{"$f":"Account!$AB$2","v":0},{"$f":"Usage!$X33","v":0},{"$f":"Usage!$W33","v":0},{"$f":"Account!$AA$2","v":0},{"$f":"Usage!$Y33","v":0},{"$f":"Usage!$Z33","v":0},0]
[{"$f":"Tenant!$A34","v":33},{"$f":"Account!$C$2","v":0},{"$f":"Account!$I$2","v":0},{"$f":"Tenant!$B34","v":0},{"$f":"Tenant!$C34","v":0},{"$f":"Tenant!$D34","v":0},{"$f":"Tenant!$E34","v":0},{"$f":"Tenant!$G34","v":0},{"$f":"Usage!$D34","v":"00:00:00"},{"$f":"Usage!$E34","v":"00:00:00"},{"$f":"Usage!$F34","v":0},{"$f":"Usage!$G34","v":0},{"$f":"Usage!$H34","v":0},{"$f":"Usage!$L34","v":0},{"$f":"Account!$AI$2","v":0},{"$f":"Usage!$N34","v":0},{"$f":"Usage!$M34","v":0},{"$f":"Account!$AH$2","v":0},{"$f":"Usage!$O34","v":0},0,{"$f":"Tenant!$H34","v":0},{"$f":"Account!$Y$2/100","v":0},{"$f":"Usage!$R34","v":0},{"$f":"Account!$X$2/100","v":0},{"$f":"Usage!$S34","v":0},{"$f":"Tenant!$I34","v":0},{"$f":"Usage!$V34","v":0},{"$f":"Account!$AB$2","v":0},{"$f":"Usage!$X34","v":0},{"$f":"Usage!$W34","v":0},{"$f":"Account!$AA$2","v":0},{"$f":"Usage!$Y34","v":0},{"$f":"Usage!$Z34","v":0},0]
[{"$f":"Tenant!$A35","v":34},{"$f":"Account!$C$2","v":0},{"$f":"Account!$I$2","v":0},{"$f":"Tenant!$B35","v":0},{"$f":"Tenant!$C35","v":0},{"$f":"Tenant!$D35","v":0},{"$f":"Tenant!$E35","v":0},{"$f":"Tenant!$G35","v":0},{"$f":"Usage!$D35","v":"00:00:00"},{"$f":"Usage!$E35","v":"00:00:00"},{"$f":"Usage!$F35","v":0},{"$f":"Usage!$G35","v":0},{"$f":"Usage!$H35","v":0},{"$f":"Usage!$L35","v":0},{"$f":"Account!$AI$2","v":0},{"$f":"Usage!$N35","v":0},{"$f":"Usage!$M35","v":0},{"$f":"Account!$AH$2","v":0},{"$f":"Usage!$O35","v":0},0,{"$f":"Tenant!$H35","v":0},{"$f":"Account!$Y$2/100","v":0},{"$f":"Usage!$R35","v":0},{"$f":"Account!$X$2/100","v":0},{"$f":"Usage!$S35","v":0},{"$f":"Tenant!$I35","v":0},{"$f":"Usage!$V35","v":0},{"$f":"Account!$AB$2","v":0},{"$f":"Usage!$X35","v":0},{"$f":"Usage!$W35","v":0},{"$f":"Account!$AA$2","v":0},{"$f":"Usage!$Y35","v":0},{"$f":"Usage!$Z35","v":0},0]
[{"$f":"Tenant!$A36","v":35},{"$f":"Account!$C$2","v":0},{"$f":"Account!$I$2","v":0},{"$f":"Tenant!$B36","v":0},{"$f":"Tenant!$C36","v":0},{"$f":"Tenant!$D36","v":0},{"$f":"Tenant!$E36","v":0},{"$f":"Tenant!$G36","v":0},{"$f":"Usage!$D36","v":"00:00:00"},{"$f":"Usage!$E36","v":"00:00:00"},{"$f":"Usage!$F36","v":0},{"$f":"Usage!$G36","v":0},{"$f":"Usage!$H36","v":0},{"$f":"Usage!$L36","v":0},{"$f":"Account!$AI$2","v":0},{"$f":"Usage!$N36","v":0},{"$f":"Usage!$M36","v":0},{"$f":"Account!$AH$2","v":0},{"$f":"Usage!$O36","v":0},0,{"$f":"Tenant!$H36","v":0},{"$f":"Account!$Y$2/100","v":0},{"$f":"Usage!$R36","v":0},{"$f":"Account!$X$2/100","v":0},{"$f":"Usage!$S36","v":0},{"$f":"Tenant!$I36","v":0},{"$f":"Usage!$V36","v":0},{"$f":"Account!$AB$2","v":0},{"$f":"Usage!$X36","v":0},{"$f":"Usage!$W36","v":0},{"$f":"Account!$AA$2","v":0},{"$f":"Usage!$Y36","v":0},{"$f":"Usage!$Z36","v":0},0]
[{"$f":"Tenant!$A37","v":36},{"$f":"Account!$C$2","v":0},{"$f":"Account!$I$2","v":0},{"$f":"Tenant!$B37","v":0},{"$f":"Tenant!$C37","v":0},{"$f":"Tenant!$D37","v":0},{"$f":"Tenant!$E37","v":0},{"$f":"Tenant!$G37","v":0},{"$f":"Usage!$D37","v":"00:00:00"},{"$f":"Usage!$E37","v":"00:00:00"},{"$f":"Usage!$F37","v":0},{"$f":"Usage!$G37","v":0},{"$f":"Usage!$H37","v":0},{"$f":"Usage!$L37","v":0},{"$f":"Account!$AI$2","v":0},{"$f":"Usage!$N37","v":0},{"$f":"Usage!$M37","v":0},{"$f":"Account!$AH$2","v":0},{"$f":"Usage!$O37","v":0},0,{"$f":"Tenant!$H37","v":0},{"$f":"Account!$Y$2/100","v":0},{"$f":"Usage!$R37","v":0},{"$f":"Account!$X$2/100","v":0},{"$f":"Usage!$S37","v":0},{"$f":"Tenant!$I37","v":0},{"$f":"Usage!$V37","v":0},{"$f":"Account!$AB$2","v":0},{"$f":"Usage!$X37","v":0},{"$f":"Usage!$W37","v":0},{"$f":"Account!$AA$2","v":0},{"$f":"Usage!$Y37","v":0},{"$f":"Usage!$Z37","v":0},0]
[{"$f":"Tenant!$A38","v":37},{"$f":"Account!$C$2","v":0},{"$f":"Account!$I$2","v":0},{"$f":"Tenant!$B38","v":0},{"$f":"Tenant!$C38","v":0},{"$f":"Tenant!$D38","v":0},{"$f":"Tenant!$E38","v":0},{"$f":"Tenant!$G38","v":0},{"$f":"Usage!$D38","v":"00:00:00"},{"$f":"Usage!$E38","v":"00:00:00"},{"$f":"Usage!$F38","v":0},{"$f":"Usage!$G38","v":0},{"$f":"Usage!$H38","v":0},{"$f":"Usage!$L38","v":0},{"$f":"Account!$AI$2","v":0},{"$f":"Usage!$N38","v":0},{"$f":"Usage!$M38","v":0},{"$f":"Account!$AH$2","v":0},{"$f":"Usage!$O38","v":0},0,{"$f":"Tenant!$H38","v":0},{"$f":"Account!$Y$2/100","v":0},{"$f":"Usage!$R38","v":0},{"$f":"Account!$X$2/100","v":0},{"$f":"Usage!$S38","v":0},{"$f":"Tenant!$I38","v":0},{"$f":"Usage!$V38","v":0},{"$f":"Account!$AB$2","v":0},{"$f":"Usage!$X38","v":0},{"$f":"Usage!$W38","v":0},{"$f":"Account!$AA$2","v":0},{"$f":"Usage!$Y38","v":0},{"$f":"Usage!$Z38","v":0},0]
[{"$f":"Tenant!$A39","v":38},{"$f":"Account!$C$2","v":0},{"$f":"Account!$I$2","v":0},{"$f":"Tenant!$B39","v":0},{"$f":"Tenant!$C39","v":0},{"$f":"Tenant!$D39","v":0},{"$f":"Tenant!$E39","v":0},{"$f":"Tenant!$G39","v":0},{"$f":"Usage!$D39","v":"00:00:00"},{"$f":"Usage!$E39","v":"00:00:00"},{"$f":"Usage!$F39","v":0},{"$f":"Usage!$G39","v":0},{"$f":"Usage!$H39","v":0},{"$f":"Usage!$L39","v":0},{"$f":"Account!$AI$2","v":0},{"$f":"Usage!$N39","v":0},{"$f":"Usage!$M39","v":0},{"$f":"Account!$AH$2","v":0},{"$f":"Usage!$O39","v":0},0,{"$f":"Tenant!$H39","v":0},{"$f":"Account!$Y$2/100","v":0},{"$f":"Usage!$R39","v":0},{"$f":"Account!$X$2/100","v":0},{"$f":"Usage!$S39","v":0},{"$f":"Tenant!$I39","v":0},{"$f":"Usage!$V39","v":0},{"$f":"Account!$AB$2","v":0},{"$f":"Usage!$X39","v":0},{"$f":"Usage!$W39","v":0},{"$f":"Account!$AA$2","v":0},{"$f":"Usage!$Y39","v":0},{"$f":"Usage!$Z39","v":0},0]
[{"$f":"Tenant!$A40","v":39},{"$f":"Account!$C$2","v":0},{"$f":"Account!$I$2","v":0},{"$f":"Tenant!$B40","v":0},{"$f":"Tenant!$C40","v":0},{"$f":"Tenant!$D40","v":0},{"$f":"Tenant!$E40","v":0},{"$f":"Tenant!$G40","v":0},{"$f":"Usage!$D40","v":"00:00:00"},{"$f":"Usage!$E40","v":"00:00:00"},{"$f":"Usage!$F40","v":0},{"$f":"Usage!$G40","v":0},{"$f":"Usage!$H40","v":0},{"$f":"Usage!$L40","v":0},{"$f":"Account!$AI$2","v":0},{"$f":"Usage!$N40","v":0},{"$f":"Usage!$M40","v":0},{"$f":"Account!$AH$2","v":0},{"$f":"Usage!$O40","v":0},0,{"$f":"Tenant!$H40","v":0},{"$f":"Account!$Y$2/100","v":0},{"$f":"Usage!$R40","v":0},{"$f":"Account!$X$2/100","v":0},{"$f":"Usage!$S40","v":0},{"$f":"Tenant!$I40","v":0},{"$f":"Usage!$V40","v":0},{"$f":"Account!$AB$2","v":0},{"$f":"Usage!$X40","v":0},{"$f":"Usage!$W40","v":0},{"$f":"Account!$AA$2","v":0},{"$f":"Usage!$Y40","v":0},{"$f":"Usage!$Z40","v":0},0]
[{"$f":"Tenant!$A41","v":40},{"$f":"Account!$C$2","v":0},{"$f":"Account!$I$2","v":0},{"$f":"Tenant!$B41","v":0},{"$f":"Tenant!$C41","v":0},{"$f":"Tenant!$D41","v":0},{"$f":"Tenant!$E41","v":0},{"$f":"Tenant!$G41","v":0},{"$f":"Usage!$D41","v":"00:00:00"},{"$f":"Usage!$E41","v":"00:00:00"},{"$f":"Usage!$F41","v":0},{"$f":"Usage!$G41","v":0},{"$f":"Usage!$H41","v":0},{"$f":"Usage!$L41","v":0},{"$f":"Account!$AI$2","v":0},{"$f":"Usage!$N41","v":0},{"$f":"Usage!$M41","v":0},{"$f":"Account!$AH$2","v":0},{"$f":"Usage!$O41","v":0},0,{"$f":"Tenant!$H41","v":0},{"$f":"Account!$Y$2/100","v":0},{"$f":"Usage!$R41","v":0},{"$f":"Account!$X$2/100","v":0},{"$f":"Usage!$S41","v":0},{"$f":"Tenant!$I41","v":0},{"$f":"Usage!$V41","v":0},{"$f":"Account!$AB$2","v":0},{"$f":"Usage!$X41","v":0},{"$f":"Usage!$W41","v":0},{"$f":"Account!$AA$2","v":0},{"$f":"Usage!$Y41","v":0},{"$f":"Usage!$Z41","v":0},0]
[{"$f":"Tenant!$A42","v":41},{"$f":"Account!$C$2","v":0},{"$f":"Account!$I$2","v":0},{"$f":"Tenant!$B42","v":0},{"$f":"Tenant!$C42","v":0},{"$f":"Tenant!$D42","v":0},{"$f":"Tenant!$E42","v":0},{"$f":"Tenant!$G42","v":0},{"$f":"Usage!$D42","v":"00:00:00"},{"$f":"Usage!$E42","v":"00:00:00"},{"$f":"Usage!$F42","v":0},{"$f":"Usage!$G42","v":0},{"$f":"Usage!$H42","v":0},{"$f":"Usage!$L42","v":0},{"$f":"Account!$AI$2","v":0},{"$f":"Usage!$N42","v":0},{"$f":"Usage!$M42","v":0},{"$f":"Account!$AH$2","v":0},{"$f":"Usage!$O42","v":0},0,{"$f":"Tenant!$H42","v":0},{"$f":"Account!$Y$2/100","v":0},{"$f":"Usage!$R42","v":0},{"$f":"Account!$X$2/100","v":0},{"$f":"Usage!$S42","v":0},{"$f":"Tenant!$I42","v":0},{"$f":"Usage!$V42","v":0},{"$f":"Account!$AB$2","v":0},{"$f":"Usage!$X42","v":0},{"$f":"Usage!$W42","v":0},{"$f":"Account!$AA$2","v":0},{"$f":"Usage!$Y42","v":0},{"$f":"Usage!$Z42","v":0},0]
[{"$f":"Tenant!$A43","v":42},{"$f":"Account!$C$2","v":0},{"$f":"Account!$I$2","v":0},{"$f":"Tenant!$B43","v":0},{"$f":"Tenant!$C43","v":0},{"$f":"Tenant!$D43","v":0},{"$f":"Tenant!$E43","v":0},{"$f":"Tenant!$G43","v":0},{"$f":"Usage!$D43","v":"00:00:00"},{"$f":"Usage!$E43","v":"00:00:00"},{"$f":"Usage!$F43","v":0},{"$f":"Usage!$G43","v":0},{"$f":"Usage!$H43","v":0},{"$f":"Usage!$L43","v":0},{"$f":"Account!$AI$2","v":0},{"$f":"Usage!$N43","v":0},{"$f":"Usage!$M43","v":0},{"$f":"Account!$AH$2","v":0},{"$f":"Usage!$O43","v":0},0,{"$f":"Tenant!$H43","v":0},{"$f":"Account!$Y$2/100","v":0},{"$f":"Usage!$R43","v":0},{"$f":"Account!$X$2/100","v":0},{"$f":"Usage!$S43","v":0},{"$f":"Tenant!$I43","v":0},{"$f":"Usage!$V43","v":0},{"$f":"Account!$AB$2","v":0},{"$f":"Usage!$X43","v":0},{"$f":"Usage!$W43","v":0},{"$f":"Account!$AA$2","v":0},{"$f":"Usage!$Y43","v":0},{"$f":"Usage!$Z43","v":0},0]
[{"$f":"Tenant!$A44","v":43},{"$f":"Account!$C$2","v":0},{"$f":"Account!$I$2","v":0},{"$f":"Tenant!$B44","v":0},{"$f":"Tenant!$C44","v":0},{"$f":"Tenant!$D44","v":0},{"$f":"Tenant!$E44","v":0},{"$f":"Tenant!$G44","v":0},{"$f":"Usage!$D44","v":"00:00:00"},{"$f":"Usage!$E44","v":"00:00:00"},{"$f":"Usage!$F44","v":0},{"$f":"Usage!$G44","v":0},{"$f":"Usage!$H44","v":0},{"$f":"Usage!$L44","v":0},{"$f":"Account!$AI$2","v":0},{"$f":"Usage!$N44","v":0},{"$f":"Usage!$M44","v":0},{"$f":"Account!$AH$2","v":0},{"$f":"Usage!$O44","v":0},0,{"$f":"Tenant!$H44","v":0},{"$f":"Account!$Y$2/100","v":0},{"$f":"Usage!$R44","v":0},{"$f":"Account!$X$2/100","v":0},{"$f":"Usage!$S44","v":0},{"$f":"Tenant!$I44","v":0},{"$f":"Usage!$V44","v":0},{"$f":"Account!$AB$2","v":0},{"$f":"Usage!$X44","v":0},{"$f":"Usage!$W44","v":0},{"$f":"Account!$AA$2","v":0},{"$f":"Usage!$Y44","v":0},{"$f":"Usage!$Z44","v":0},0]
[{"$f":"Tenant!$A45","v":44},{"$f":"Account!$C$2","v":0},{"$f":"Account!$I$2","v":0},{"$f":"Tenant!$B45","v":0},{"$f":"Tenant!$C45","v":0},{"$f":"Tenant!$D45","v":0},{"$f":"Tenant!$E45","v":0},{"$f":"Tenant!$G45","v":0},{"$f":"Usage!$D45","v":"00:00:00"},{"$f":"Usage!$E45","v":"00:00:00"},{"$f":"Usage!$F45","v":0},{"$f":"Usage!$G45","v":0},{"$f":"Usage!$H45","v":0},{"$f":"Usage!$L45","v":0},{"$f":"Account!$AI$2","v":0},{"$f":"Usage!$N45","v":0},{"$f":"Usage!$M45","v":0},{"$f":"Account!$AH$2","v":0},{"$f":"Usage!$O45","v":0},0,{"$f":"Tenant!$H45","v":0},{"$f":"Account!$Y$2/100","v":0},{"$f":"Usage!$R45","v":0},{"$f":"Account!$X$2/100","v":0},{"$f":"Usage!$S45","v":0},{"$f":"Tenant!$I45","v":0},{"$f":"Usage!$V45","v":0},{"$f":"Account!$AB$2","v":0},{"$f":"Usage!$X45","v":0},{"$f":"Usage!$W45","v":0},{"$f":"Account!$AA$2","v":0},{"$f":"Usage!$Y45","v":0},{"$f":"Usage!$Z45","v":0},0]
[{"$f":"Tenant!$A46","v":45},{"$f":"Account!$C$2","v":0},{"$f":"Account!$I$2","v":0},{"$f":"Tenant!$B46","v":0},{"$f":"Tenant!$C46","v":0},{"$f":"Tenant!$D46","v":0},{"$f":"Tenant!$E46","v":0},{"$f":"Tenant!$G46","v":0},{"$f":"Usage!$D46","v":"00:00:00"},{"$f":"Usage!$E46","v":"00:00:00"},{"$f":"Usage!$F46","v":0},{"$f":"Usage!$G46","v":0},{"$f":"Usage!$H46","v":0},{"$f":"Usage!$L46","v":0},{"$f":"Account!$AI$2","v":0},{"$f":"Usage!$N46","v":0},{"$f":"Usage!$M46","v":0},{"$f":"Account!$AH$2","v":0},{"$f":"Usage!$O46","v":0},0,{"$f":"Tenant!$H46","v":0},{"$f":"Account!$Y$2/100","v":0},{"$f":"Usage!$R46","v":0},{"$f":"Account!$X$2/100","v":0},{"$f":"Usage!$S46","v":0},{"$f":"Tenant!$I46","v":0},{"$f":"Usage!$V46","v":0},{"$f":"Account!$AB$2","v":0},{"$f":"Usage!$X46","v":0},{"$f":"Usage!$W46","v":0},{"$f":"Account!$AA$2","v":0},{"$f":"Usage!$Y46","v":0},{"$f":"Usage!$Z46","v":0},0]
[{"$f":"Tenant!$A47","v":46},{"$f":"Account!$C$2","v":0},{"$f":"Account!$I$2","v":0},{"$f":"Tenant!$B47","v":0},{"$f":"Tenant!$C47","v":0},{"$f":"Tenant!$D47","v":0},{"$f":"Tenant!$E47","v":0},{"$f":"Tenant!$G47","v":0},{"$f":"Usage!$D47","v":"00:00:00"},{"$f":"Usage!$E47","v":"00:00:00"},{"$f":"Usage!$F47","v":0},{"$f":"Usage!$G47","v":0},{"$f":"Usage!$H47","v":0},{"$f":"Usage!$L47","v":0},{"$f":"Account!$AI$2","v":0},{"$f":"Usage!$N47","v":0},{"$f":"Usage!$M47","v":0},{"$f":"Account!$AH$2","v":0},{"$f":"Usage!$O47","v":0},0,{"$f":"Tenant!$H47","v":0},{"$f":"Account!$Y$2/100","v":0},{"$f":"Usage!$R47","v":0},{"$f":"Account!$X$2/100","v":0},{"$f":"Usage!$S47","v":0},{"$f":"Tenant!$I47","v":0},{"$f":"Usage!$V47","v":0},{"$f":"Account!$AB$2","v":0},{"$f":"Usage!$X47","v":0},{"$f":"Usage!$W47","v":0},{"$f":"Account!$AA$2","v":0},{"$f":"Usage!$Y47","v":0},{"$f":"Usage!$Z47","v":0},0]
[{"$f":"Tenant!$A48","v":47},{"$f":"Account!$C$2","v":0},{"$f":"Account!$I$2","v":0},{"$f":"Tenant!$B48","v":0},{"$f":"Tenant!$C48","v":0},{"$f":"Tenant!$D48","v":0},{"$f":"Tenant!$E48","v":0},{"$f":"Tenant!$G48","v":0},{"$f":"Usage!$D48","v":"00:00:00"},{"$f":"Usage!$E48","v":"00:00:00"},{"$f":"Usage!$F48","v":0},{"$f":"Usage!$G48","v":0},{"$f":"Usage!$H48","v":0},{"$f":"Usage!$L48","v":0},{"$f":"Account!$AI$2","v":0},{"$f":"Usage!$N48","v":0},{"$f":"Usage!$M48","v":0},{"$f":"Account!$AH$2","v":0},{"$f":"Usage!$O48","v":0},0,{"$f":"Tenant!$H48","v":0},{"$f":"Account!$Y$2/100","v":0},{"$f":"Usage!$R48","v":0},{"$f":"Account!$X$2/100","v":0},{"$f":"Usage!$S48","v":0},{"$f":"Tenant!$I48","v":0},{"$f":"Usage!$V48","v":0},{"$f":"Account!$AB$2","v":0},{"$f":"Usage!$X48","v":0},{"$f":"Usage!$W48","v":0},{"$f":"Account!$AA$2","v":0},{"$f":"Usage!$Y48","v":0},{"$f":"Usage!$Z48","v":0},0]
[{"$f":"Tenant!$A49","v":48},{"$f":"Account!$C$2","v":0},{"$f":"Account!$I$2","v":0},{"$f":"Tenant!$B49","v":0},{"$f":"Tenant!$C49","v":0},{"$f":"Tenant!$D49","v":0},{"$f":"Tenant!$E49","v":0},{"$f":"Tenant!$G49","v":0},{"$f":"Usage!$D49","v":"00:00:00"},{"$f":"Usage!$E49","v":"00:00:00"},{"$f":"Usage!$F49","v":0},{"$f":"Usage!$G49","v":0},{"$f":"Usage!$H49","v":0},{"$f":"Usage!$L49","v":0},{"$f":"Account!$AI$2","v":0},{"$f":"Usage!$N49","v":0},{"$f":"Usage!$M49","v":0},{"$f":"Account!$AH$2","v":0},{"$f":"Usage!$O49","v":0},0,{"$f":"Tenant!$H49","v":0},{"$f":"Account!$Y$2/100","v":0},{"$f":"Usage!$R49","v":0},{"$f":"Account!$X$2/100","v":0},{"$f":"Usage!$S49","v":0},{"$f":"Tenant!$I49","v":0},{"$f":"Usage!$V49","v":0},{"$f":"Account!$AB$2","v":0},{"$f":"Usage!$X49","v":0},{"$f":"Usage!$W49","v":0},{"$f":"Account!$AA$2","v":0},{"$f":"Usage!$Y49","v":0},{"$f":"Usage!$Z49","v":0},0]
[{"$f":"Tenant!$A50","v":49},{"$f":"Account!$C$2","v":0},{"$f":"Account!$I$2","v":0},{"$f":"Tenant!$B50","v":0},{"$f":"Tenant!$C50","v":0},{"$f":"Tenant!$D50","v":0},{"$f":"Tenant!$E50","v":0},{"$f":"Tenant!$G50","v":0},{"$f":"Usage!$D50","v":"00:00:00"},{"$f":"Usage!$E50","v":"00:00:00"},{"$f":"Usage!$F50","v":0},{"$f":"Usage!$G50","v":0},{"$f":"Usage!$H50","v":0},{"$f":"Usage!$L50","v":0},{"$f":"Account!$AI$2","v":0},{"$f":"Usage!$N50","v":0},{"$f":"Usage!$M50","v":0},{"$f":"Account!$AH$2","v":0},{"$f":"Usage!$O50","v":0},0,{"$f":"Tenant!$H50","v":0},{"$f":"Account!$Y$2/100","v":0},{"$f":"Usage!$R50","v":0},{"$f":"Account!$X$2/100","v":0},{"$f":"Usage!$S50","v":0},{"$f":"Tenant!$I50","v":0},{"$f":"Usage!$V50","v":0},{"$f":"Account!$AB$2","v":0},{"$f":"Usage!$X50","v":0},{"$f":"Usage!$W50","v":0},{"$f":"Account!$AA$2","v":0},{"$f":"Usage!$Y50","v":0},{"$f":"Usage!$Z50","v":0},0]
[{"$f":"Tenant!$A51","v":50},{"$f":"Account!$C$2","v":0},{"$f":"Account!$I$2","v":0},{"$f":"Tenant!$B51","v":0},{"$f":"Tenant!$C51","v":0},{"$f":"Tenant!$D51","v":0},{"$f":"Tenant!$E51","v":0},{"$f":"Tenant!$G51","v":0},{"$f":"Usage!$D51","v":"00:00:00"},{"$f":"Usage!$E51","v":"00:00:00"},{"$f":"Usage!$F51","v":0},{"$f":"Usage!$G51","v":0},{"$f":"Usage!$H51","v":0},{"$f":"Usage!$L51","v":0},{"$f":"Account!$AI$2","v":0},{"$f":"Usage!$N51","v":0},{"$f":"Usage!$M51","v":0},{"$f":"Account!$AH$2","v":0},{"$f":"Usage!$O51","v":0},0,{"$f":"Tenant!$H51","v":0},{"$f":"Account!$Y$2/100","v":0},{"$f":"Usage!$R51","v":0},{"$f":"Account!$X$2/100","v":0},{"$f":"Usage!$S51","v":0},{"$f":"Tenant!$I51","v":0},{"$f":"Usage!$V51","v":0},{"$f":"Account!$AB$2","v":0},{"$f":"Usage!$X51","v":0},{"$f":"Usage!$W51","v":0},{"$f":"Account!$AA$2","v":0},{"$f":"Usage!$Y51","v":0},{"$f":"Usage!$Z51","v":0},0]
[{"$f":"Tenant!$A52","v":51},{"$f":"Account!$C$2","v":0},{"$f":"Account!$I$2","v":0},{"$f":"Tenant!$B52","v":0},{"$f":"Tenant!$C52","v":0},{"$f":"Tenant!$D52","v":0},{"$f":"Tenant!$E52","v":0},{"$f":"Tenant!$G52","v":0},{"$f":"Usage!$D52","v":"00:00:00"},{"$f":"Usage!$E52","v":"00:00:00"},{"$f":"Usage!$F52","v":0},{"$f":"Usage!$G52","v":0},{"$f":"Usage!$H52","v":0},{"$f":"Usage!$L52","v":0},{"$f":"Account!$AI$2","v":0},{"$f":"Usage!$N52","v":0},{"$f":"Usage!$M52","v":0},{"$f":"Account!$AH$2","v":0},{"$f":"Usage!$O52","v":0},0,{"$f":"Tenant!$H52","v":0},{"$f":"Account!$Y$2/100","v":0},{"$f":"Usage!$R52","v":0},{"$f":"Account!$X$2/100","v":0},{"$f":"Usage!$S52","v":0},{"$f":"Tenant!$I52","v":0},{"$f":"Usage!$V52","v":0},{"$f":"Account!$AB$2","v":0},{"$f":"Usage!$X52","v":0},{"$f":"Usage!$W52","v":0},{"$f":"Account!$AA$2","v":0},{"$f":"Usage!$Y52","v":0},{"$f":"Usage!$Z52","v":0},0]
[{"$f":"Tenant!$A53","v":52},{"$f":"Account!$C$2","v":0},{"$f":"Account!$I$2","v":0},{"$f":"Tenant!$B53","v":0},{"$f":"Tenant!$C53","v":0},{"$f":"Tenant!$D53","v":0},{"$f":"Tenant!$E53","v":0},{"$f":"Tenant!$G53","v":0},{"$f":"Usage!$D53","v":"00:00:00"},{"$f":"Usage!$E53","v":"00:00:00"},{"$f":"Usage!$F53","v":0},{"$f":"Usage!$G53","v":0},{"$f":"Usage!$H53","v":0},{"$f":"Usage!$L53","v":0},{"$f":"Account!$AI$2","v":0},{"$f":"Usage!$N53","v":0},{"$f":"Usage!$M53","v":0},{"$f":"Account!$AH$2","v":0},{"$f":"Usage!$O53","v":0},0,{"$f":"Tenant!$H53","v":0},{"$f":"Account!$Y$2/100","v":0},{"$f":"Usage!$R53","v":0},{"$f":"Account!$X$2/100","v":0},{"$f":"Usage!$S53","v":0},{"$f":"Tenant!$I53","v":0},{"$f":"Usage!$V53","v":0},{"$f":"Account!$AB$2","v":0},{"$f":"Usage!$X53","v":0},{"$f":"Usage!$W53","v":0},{"$f":"Account!$AA$2","v":0},{"$f":"Usage!$Y53","v":0},{"$f":"Usage!$Z53","v":0},0]
[{"$f":"Tenant!$A54","v":53},{"$f":"Account!$C$2","v":0},{"$f":"Account!$I$2","v":0},{"$f":"Tenant!$B54","v":0},{"$f":"Tenant!$C54","v":0},{"$f":"Tenant!$D54","v":0},{"$f":"Tenant!$E54","v":0},{"$f":"Tenant!$G54","v":0},{"$f":"Usage!$D54","v":"00:00:00"},{"$f":"Usage!$E54","v":"00:00:00"},{"$f":"Usage!$F54","v":0},{"$f":"Usage!$G54","v":0},{"$f":"Usage!$H54","v":0},{"$f":"Usage!$L54","v":0},{"$f":"Account!$AI$2","v":0},{"$f":"Usage!$N54","v":0},{"$f":"Usage!$M54","v":0},{"$f":"Account!$AH$2","v":0},{"$f":"Usage!$O54","v":0},0,{"$f":"Tenant!$H54","v":0},{"$f":"Account!$Y$2/100","v":0},{"$f":"Usage!$R54","v":0},{"$f":"Account!$X$2/100","v":0},{"$f":"Usage!$S54","v":0},{"$f":"Tenant!$I54","v":0},{"$f":"Usage!$V54","v":0},{"$f":"Account!$AB$2","v":0},{"$f":"Usage!$X54","v":0},{"$f":"Usage!$W54","v":0},{"$f":"Account!$AA$2","v":0},{"$f":"Usage!$Y54","v":0},{"$f":"Usage!$Z54","v":0},0]
[{"$f":"Tenant!$A55","v":54},{"$f":"Account!$C$2","v":0},{"$f":"Account!$I$2","v":0},{"$f":"Tenant!$B55","v":0},{"$f":"Tenant!$C55","v":0},{"$f":"Tenant!$D55","v":0},{"$f":"Tenant!$E55","v":0},{"$f":"Tenant!$G55","v":0},{"$f":"Usage!$D55","v":"00:00:00"},{"$f":"Usage!$E55","v":"00:00:00"},{"$f":"Usage!$F55","v":0},{"$f":"Usage!$G55","v":0},{"$f":"Usage!$H55","v":0},{"$f":"Usage!$L55","v":0},{"$f":"Account!$AI$2","v":0},{"$f":"Usage!$N55","v":0},{"$f":"Usage!$M55","v":0},{"$f":"Account!$AH$2","v":0},{"$f":"Usage!$O55","v":0},0,{"$f":"Tenant!$H55","v":0},{"$f":"Account!$Y$2/100","v":0},{"$f":"Usage!$R55","v":0},{"$f":"Account!$X$2/100","v":0},{"$f":"Usage!$S55","v":0},{"$f":"Tenant!$I55","v":0},{"$f":"Usage!$V55","v":0},{"$f":"Account!$AB$2","v":0},{"$f":"Usage!$X55","v":0},{"$f":"Usage!$W55","v":0},{"$f":"Account!$AA$2","v":0},{"$f":"Usage!$Y55","v":0},{"$f":"Usage!$Z55","v":0},0]
[{"$f":"Tenant!$A56","v":55},{"$f":"Account!$C$2","v":0},{"$f":"Account!$I$2","v":0},{"$f":"Tenant!$B56","v":0},{"$f":"Tenant!$C56","v":0},{"$f":"Tenant!$D56","v":0},{"$f":"Tenant!$E56","v":0},{"$f":"Tenant!$G56","v":0},{"$f":"Usage!$D56","v":"00:00:00"},{"$f":"Usage!$E56","v":"00:00:00"},{"$f":"Usage!$F56","v":0},{"$f":"Usage!$G56","v":0},{"$f":"Usage!$H56","v":0},{"$f":"Usage!$L56","v":0},{"$f":"Account!$AI$2","v":0},{"$f":"Usage!$N56","v":0},{"$f":"Usage!$M56","v":0},{"$f":"Account!$AH$2","v":0},{"$f":"Usage!$O56","v":0},0,{"$f":"Tenant!$H56","v":0},{"$f":"Account!$Y$2/100","v":0},{"$f":"Usage!$R56","v":0},{"$f":"Account!$X$2/100","v":0},{"$f":"Usage!$S56","v":0},{"$f":"Tenant!$I56","v":0},{"$f":"Usage!$V56","v":0},{"$f":"Account!$AB$2","v":0},{"$f":"Usage!$X56","v":0},{"$f":"Usage!$W56","v":0},{"$f":"Account!$AA$2","v":0},{"$f":"Usage!$Y56","v":0},{"$f":"Usage!$Z56","v":0},0]
[{"$f":"Tenant!$A57","v":56},{"$f":"Account!$C$2","v":0},{"$f":"Account!$I$2","v":0},{"$f":"Tenant!$B57","v":0},{"$f":"Tenant!$C57","v":0},{"$f":"Tenant!$D57","v":0},{"$f":"Tenant!$E57","v":0},{"$f":"Tenant!$G57","v":0},{"$f":"Usage!$D57","v":"00:00:00"},{"$f":"Usage!$E57","v":"00:00:00"},{"$f":"Usage!$F57","v":0},{"$f":"Usage!$G57","v":0},{"$f":"Usage!$H57","v":0},{"$f":"Usage!$L57","v":0},{"$f":"Account!$AI$2","v":0},{"$f":"Usage!$N57","v":0},{"$f":"Usage!$M57","v":0},{"$f":"Account!$AH$2","v":0},{"$f":"Usage!$O57","v":0},0,{"$f":"Tenant!$H57","v":0},{"$f":"Account!$Y$2/100","v":0},{"$f":"Usage!$R57","v":0},{"$f":"Account!$X$2/100","v":0},{"$f":"Usage!$S57","v":0},{"$f":"Tenant!$I57","v":0},{"$f":"Usage!$V57","v":0},{"$f":"Account!$AB$2","v":0},{"$f":"Usage!$X57","v":0},{"$f":"Usage!$W57","v":0},{"$f":"Account!$AA$2","v":0},{"$f":"Usage!$Y57","v":0},{"$f":"Usage!$Z57","v":0},0]
[{"$f":"Tenant!$A58","v":57},{"$f":"Account!$C$2","v":0},{"$f":"Account!$I$2","v":0},{"$f":"Tenant!$B58","v":0},{"$f":"Tenant!$C58","v":0},{"$f":"Tenant!$D58","v":0},{"$f":"Tenant!$E58","v":0},{"$f":"Tenant!$G58","v":0},{"$f":"Usage!$D58","v":"00:00:00"},{"$f":"Usage!$E58","v":"00:00:00"},{"$f":"Usage!$F58","v":0},{"$f":"Usage!$G58","v":0},{"$f":"Usage!$H58","v":0},{"$f":"Usage!$L58","v":0},{"$f":"Account!$AI$2","v":0},{"$f":"Usage!$N58","v":0},{"$f":"Usage!$M58","v":0},{"$f":"Account!$AH$2","v":0},{"$f":"Usage!$O58","v":0},0,{"$f":"Tenant!$H58","v":0},{"$f":"Account!$Y$2/100","v":0},{"$f":"Usage!$R58","v":0},{"$f":"Account!$X$2/100","v":0},{"$f":"Usage!$S58","v":0},{"$f":"Tenant!$I58","v":0},{"$f":"Usage!$V58","v":0},{"$f":"Account!$AB$2","v":0},{"$f":"Usage!$X58","v":0},{"$f":"Usage!$W58","v":0},{"$f":"Account!$AA$2","v":0},{"$f":"Usage!$Y58","v":0},{"$f":"Usage!$Z58","v":0},0]
[{"$f":"Tenant!$A59","v":58},{"$f":"Account!$C$2","v":0},{"$f":"Account!$I$2","v":0},{"$f":"Tenant!$B59","v":0},{"$f":"Tenant!$C59","v":0},{"$f":"Tenant!$D59","v":0},{"$f":"Tenant!$E59","v":0},{"$f":"Tenant!$G59","v":0},{"$f":"Usage!$D59","v":"00:00:00"},{"$f":"Usage!$E59","v":"00:00:00"},{"$f":"Usage!$F59","v":0},{"$f":"Usage!$G59","v":0},{"$f":"Usage!$H59","v":0},{"$f":"Usage!$L59","v":0},{"$f":"Account!$AI$2","v":0},{"$f":"Usage!$N59","v":0},{"$f":"Usage!$M59","v":0},{"$f":"Account!$AH$2","v":0},{"$f":"Usage!$O59","v":0},0,{"$f":"Tenant!$H59","v":0},{"$f":"Account!$Y$2/100","v":0},{"$f":"Usage!$R59","v":0},{"$f":"Account!$X$2/100","v":0},{"$f":"Usage!$S59","v":0},{"$f":"Tenant!$I59","v":0},{"$f":"Usage!$V59","v":0},{"$f":"Account!$AB$2","v":0},{"$f":"Usage!$X59","v":0},{"$f":"Usage!$W59","v":0},{"$f":"Account!$AA$2","v":0},{"$f":"Usage!$Y59","v":0},{"$f":"Usage!$Z59","v":0},0]
[{"$f":"Tenant!$A60","v":59},{"$f":"Account!$C$2","v":0},{"$f":"Account!$I$2","v":0},{"$f":"Tenant!$B60","v":0},{"$f":"Tenant!$C60","v":0},{"$f":"Tenant!$D60","v":0},{"$f":"Tenant!$E60","v":0},{"$f":"Tenant!$G60","v":0},{"$f":"Usage!$D60","v":"00:00:00"},{"$f":"Usage!$E60","v":"00:00:00"},{"$f":"Usage!$F60","v":0},{"$f":"Usage!$G60","v":0},{"$f":"Usage!$H60","v":0},{"$f":"Usage!$L60","v":0},{"$f":"Account!$AI$2","v":0},{"$f":"Usage!$N60","v":0},{"$f":"Usage!$M60","v":0},{"$f":"Account!$AH$2","v":0},{"$f":"Usage!$O60","v":0},0,{"$f":"Tenant!$H60","v":0},{"$f":"Account!$Y$2/100","v":0},{"$f":"Usage!$R60","v":0},{"$f":"Account!$X$2/100","v":0},{"$f":"Usage!$S60","v":0},{"$f":"Tenant!$I60","v":0},{"$f":"Usage!$V60","v":0},{"$f":"Account!$AB$2","v":0},{"$f":"Usage!$X60","v":0},{"$f":"Usage!$W60","v":0},{"$f":"Account!$AA$2","v":0},{"$f":"Usage!$Y60","v":0},{"$f":"Usage!$Z60","v":0},0]
[{"$f":"Tenant!$A61","v":60},{"$f":"Account!$C$2","v":0},{"$f":"Account!$I$2","v":0},{"$f":"Tenant!$B61","v":0},{"$f":"Tenant!$C61","v":0},{"$f":"Tenant!$D61","v":0},{"$f":"Tenant!$E61","v":0},{"$f":"Tenant!$G61","v":0},{"$f":"Usage!$D61","v":"00:00:00"},{"$f":"Usage!$E61","v":"00:00:00"},{"$f":"Usage!$F61","v":0},{"$f":"Usage!$G61","v":0},{"$f":"Usage!$H61","v":0},{"$f":"Usage!$L61","v":0},{"$f":"Account!$AI$2","v":0},{"$f":"Usage!$N61","v":0},{"$f":"Usage!$M61","v":0},{"$f":"Account!$AH$2","v":0},{"$f":"Usage!$O61","v":0},0,{"$f":"Tenant!$H61","v":0},{"$f":"Account!$Y$2/100","v":0},{"$f":"Usage!$R61","v":0},{"$f":"Account!$X$2/100","v":0},{"$f":"Usage!$S61","v":0},{"$f":"Tenant!$I61","v":0},{"$f":"Usage!$V61","v":0},{"$f":"Account!$AB$2","v":0},{"$f":"Usage!$X61","v":0},{"$f":"Usage!$W61","v":0},{"$f":"Account!$AA$2","v":0},{"$f":"Usage!$Y61","v":0},{"$f":"Usage!$Z61","v":0},0]
[{"$f":"Tenant!$A62","v":61},{"$f":"Account!$C$2","v":0},{"$f":"Account!$I$2","v":0},{"$f":"Tenant!$B62","v":0},{"$f":"Tenant!$C62","v":0},{"$f":"Tenant!$D62","v":0},{"$f":"Tenant!$E62","v":0},{"$f":"Tenant!$G62","v":0},{"$f":"Usage!$D62","v":"00:00:00"},{"$f":"Usage!$E62","v":"00:00:00"},{"$f":"Usage!$F62","v":0},{"$f":"Usage!$G62","v":0},{"$f":"Usage!$H62","v":0},{"$f":"Usage!$L62","v":0},{"$f":"Account!$AI$2","v":0},{"$f":"Usage!$N62","v":0},{"$f":"Usage!$M62","v":0},{"$f":"Account!$AH$2","v":0},{"$f":"Usage!$O62","v":0},0,{"$f":"Tenant!$H62","v":0},{"$f":"Account!$Y$2/100","v":0},{"$f":"Usage!$R62","v":0},{"$f":"Account!$X$2/100","v":0},{"$f":"Usage!$S62","v":0},{"$f":"Tenant!$I62","v":0},{"$f":"Usage!$V62","v":0},{"$f":"Account!$AB$2","v":0},{"$f":"Usage!$X62","v":0},{"$f":"Usage!$W62","v":0},{"$f":"Account!$AA$2","v":0},{"$f":"Usage!$Y62","v":0},{"$f":"Usage!$Z62","v":0},0]
[{"$f":"Tenant!$A63","v":62},{"$f":"Account!$C$2","v":0},{"$f":"Account!$I$2","v":0},{"$f":"Tenant!$B63","v":0},{"$f":"Tenant!$C63","v":0},{"$f":"Tenant!$D63","v":0},{"$f":"Tenant!$E63","v":0},{"$f":"Tenant!$G63","v":0},{"$f":"Usage!$D63","v":"00:00:00"},{"$f":"Usage!$E63","v":"00:00:00"},{"$f":"Usage!$F63","v":0},{"$f":"Usage!$G63","v":0},{"$f":"Usage!$H63","v":0},{"$f":"Usage!$L63","v":0},{"$f":"Account!$AI$2","v":0},{"$f":"Usage!$N63","v":0},{"$f":"Usage!$M63","v":0},{"$f":"Account!$AH$2","v":0},{"$f":"Usage!$O63","v":0},0,{"$f":"Tenant!$H63","v":0},{"$f":"Account!$Y$2/100","v":0},{"$f":"Usage!$R63","v":0},{"$f":"Account!$X$2/100","v":0},{"$f":"Usage!$S63","v":0},{"$f":"Tenant!$I63","v":0},{"$f":"Usage!$V63","v":0},{"$f":"Account!$AB$2","v":0},{"$f":"Usage!$X63","v":0},{"$f":"Usage!$W63","v":0},{"$f":"Account!$AA$2","v":0},{"$f":"Usage!$Y63","v":0},{"$f":"Usage!$Z63","v":0},0]
[{"$f":"Tenant!$A64","v":63},{"$f":"Account!$C$2","v":0},{"$f":"Account!$I$2","v":0},{"$f":"Tenant!$B64","v":0},{"$f":"Tenant!$C64","v":0},{"$f":"Tenant!$D64","v":0},{"$f":"Tenant!$E64","v":0},{"$f":"Tenant!$G64","v":0},{"$f":"Usage!$D64","v":"00:00:00"},{"$f":"Usage!$E64","v":"00:00:00"},{"$f":"Usage!$F64","v":0},{"$f":"Usage!$G64","v":0},{"$f":"Usage!$H64","v":0},{"$f":"Usage!$L64","v":0},{"$f":"Account!$AI$2","v":0},{"$f":"Usage!$N64","v":0},{"$f":"Usage!$M64","v":0},{"$f":"Account!$AH$2","v":0},{"$f":"Usage!$O64","v":0},0,{"$f":"Tenant!$H64","v":0},{"$f":"Account!$Y$2/100","v":0},{"$f":"Usage!$R64","v":0},{"$f":"Account!$X$2/100","v":0},{"$f":"Usage!$S64","v":0},{"$f":"Tenant!$I64","v":0},{"$f":"Usage!$V64","v":0},{"$f":"Account!$AB$2","v":0},{"$f":"Usage!$X64","v":0},{"$f":"Usage!$W64","v":0},{"$f":"Account!$AA$2","v":0},{"$f":"Usage!$Y64","v":0},{"$f":"Usage!$Z64","v":0},0]
[{"$f":"Tenant!$A65","v":64},{"$f":"Account!$C$2","v":0},{"$f":"Account!$I$2","v":0},{"$f":"Tenant!$B65","v":0},{"$f":"Tenant!$C65","v":0},{"$f":"Tenant!$D65","v":0},{"$f":"Tenant!$E65","v":0},{"$f":"Tenant!$G65","v":0},{"$f":"Usage!$D65","v":"00:00:00"},{"$f":"Usage!$E65","v":"00:00:00"},{"$f":"Usage!$F65","v":0},{"$f":"Usage!$G65","v":0},{"$f":"Usage!$H65","v":0},{"$f":"Usage!$L65","v":0},{"$f":"Account!$AI$2","v":0},{"$f":"Usage!$N65","v":0},{"$f":"Usage!$M65","v":0},{"$f":"Account!$AH$2","v":0},{"$f":"Usage!$O65","v":0},0,{"$f":"Tenant!$H65","v":0},{"$f":"Account!$Y$2/100","v":0},{"$f":"Usage!$R65","v":0},{"$f":"Account!$X$2/100","v":0},{"$f":"Usage!$S65","v":0},{"$f":"Tenant!$I65","v":0},{"$f":"Usage!$V65","v":0},{"$f":"Account!$AB$2","v":0},{"$f":"Usage!$X65","v":0},{"$f":"Usage!$W65","v":0},{"$f":"Account!$AA$2","v":0},{"$f":"Usage!$Y65","v":0},{"$f":"Usage!$Z65","v":0},0]
[{"$f":"Tenant!$A66","v":65},{"$f":"Account!$C$2","v":0},{"$f":"Account!$I$2","v":0},{"$f":"Tenant!$B66","v":0},{"$f":"Tenant!$C66","v":0},{"$f":"Tenant!$D66","v":0},{"$f":"Tenant!$E66","v":0},{"$f":"Tenant!$G66","v":0},{"$f":"Usage!$D66","v":"00:00:00"},{"$f":"Usage!$E66","v":"00:00:00"},{"$f":"Usage!$F66","v":0},{"$f":"Usage!$G66","v":0},{"$f":"Usage!$H66","v":0},{"$f":"Usage!$L66","v":0},{"$f":"Account!$AI$2","v":0},{"$f":"Usage!$N66","v":0},{"$f":"Usage!$M66","v":0},{"$f":"Account!$AH$2","v":0},{"$f":"Usage!$O66","v":0},0,{"$f":"Tenant!$H66","v":0},{"$f":"Account!$Y$2/100","v":0},{"$f":"Usage!$R66","v":0},{"$f":"Account!$X$2/100","v":0},{"$f":"Usage!$S66","v":0},{"$f":"Tenant!$I66","v":0},{"$f":"Usage!$V66","v":0},{"$f":"Account!$AB$2","v":0},{"$f":"Usage!$X66","v":0},{"$f":"Usage!$W66","v":0},{"$f":"Account!$AA$2","v":0},{"$f":"Usage!$Y66","v":0},{"$f":"Usage!$Z66","v":0},0]
[{"$f":"Tenant!$A67","v":66},{"$f":"Account!$C$2","v":0},{"$f":"Account!$I$2","v":0},{"$f":"Tenant!$B67","v":0},{"$f":"Tenant!$C67","v":0},{"$f":"Tenant!$D67","v":0},{"$f":"Tenant!$E67","v":0},{"$f":"Tenant!$G67","v":0},{"$f":"Usage!$D67","v":"00:00:00"},{"$f":"Usage!$E67","v":"00:00:00"},{"$f":"Usage!$F67","v":0},{"$f":"Usage!$G67","v":0},{"$f":"Usage!$H67","v":0},{"$f":"Usage!$L67","v":0},{"$f":"Account!$AI$2","v":0},{"$f":"Usage!$N67","v":0},{"$f":"Usage!$M67","v":0},{"$f":"Account!$AH$2","v":0},{"$f":"Usage!$O67","v":0},{"$f":"SUM($P67,$S67)","v":0},{"$f":"Tenant!$H67","v":0},{"$f":"Account!$Y$2/100","v":0},{"$f":"Usage!$R67","v":0},{"$f":"Account!$X$2/100","v":0},{"$f":"Usage!$S67","v":0},{"$f":"Tenant!$I67","v":0},{"$f":"Usage!$V67","v":0},{"$f":"Account!$AB$2","v":0},{"$f":"Usage!$X67","v":0},{"$f":"Usage!$W67","v":0},{"$f":"Account!$AA$2","v":0},{"$f":"Usage!$Y67","v":0},{"$f":"Usage!$Z67","v":0},{"$f":"$AG67","v":0}]
[{"$f":"Tenant!$A68","v":67},{"$f":"Account!$C$2","v":0},{"$f":"Account!$I$2","v":0},{"$f":"Tenant!$B68","v":0},{"$f":"Tenant!$C68","v":0},{"$f":"Tenant!$D68","v":0},{"$f":"Tenant!$E68","v":0},{"$f":"Tenant!$G68","v":0},{"$f":"Usage!$D68","v":"00:00:00"},{"$f":"Usage!$E68","v":"00:00:00"},{"$f":"Usage!$F68","v":0},{"$f":"Usage!$G68","v":0},{"$f":"Usage!$H68","v":0},{"$f":"Usage!$L68","v":0},{"$f":"Account!$AI$2","v":0},{"$f":"Usage!$N68","v":0},{"$f":"Usage!$M68","v":0},{"$f":"Account!$AH$2","v":0},{"$f":"Usage!$O68","v":0},0,{"$f":"Tenant!$H68","v":0},{"$f":"Account!$Y$2/100","v":0},{"$f":"Usage!$R68","v":0},{"$f":"Account!$X$2/100","v":0},{"$f":"Usage!$S68","v":0},{"$f":"Tenant!$I68","v":0},{"$f":"Usage!$V68","v":0},{"$f":"Account!$AB$2","v":0},{"$f":"Usage!$X68","v":0},{"$f":"Usage!$W68","v":0},{"$f":"Account!$AA$2","v":0},{"$f":"Usage!$Y68","v":0},{"$f":"Usage!$Z68","v":0},0]
[{"$f":"Tenant!$A69","v":68},{"$f":"Account!$C$2","v":0},{"$f":"Account!$I$2","v":0},{"$f":"Tenant!$B69","v":0},{"$f":"Tenant!$C69","v":0},{"$f":"Tenant!$D69","v":0},{"$f":"Tenant!$E69","v":0},{"$f":"Tenant!$G69","v":0},{"$f":"Usage!$D69","v":"00:00:00"},{"$f":"Usage!$E69","v":"00:00:00"},{"$f":"Usage!$F69","v":0},{"$f":"Usage!$G69","v":0},{"$f":"Usage!$H69","v":0},{"$f":"Usage!$L69","v":0},{"$f":"Account!$AI$2","v":0},{"$f":"Usage!$N69","v":0},{"$f":"Usage!$M69","v":0},{"$f":"Account!$AH$2","v":0},{"$f":"Usage!$O69","v":0},0,{"$f":"Tenant!$H69","v":0},{"$f":"Account!$Y$2/100","v":0},{"$f":"Usage!$R69","v":0},{"$f":"Account!$X$2/100","v":0},{"$f":"Usage!$S69","v":0},{"$f":"Tenant!$I69","v":0},{"$f":"Usage!$V69","v":0},{"$f":"Account!$AB$2","v":0},{"$f":"Usage!$X69","v":0},{"$f":"Usage!$W69","v":0},{"$f":"Account!$AA$2","v":0},{"$f":"Usage!$Y69","v":0},{"$f":"Usage!$Z69","v":0},0]
[{"$f":"Tenant!$A70","v":69},{"$f":"Account!$C$2","v":0},{"$f":"Account!$I$2","v":0},{"$f":"Tenant!$B70","v":0},{"$f":"Tenant!$C70","v":0},{"$f":"Tenant!$D70","v":0},{"$f":"Tenant!$E70","v":0},{"$f":"Tenant!$G70","v":0},{"$f":"Usage!$D70","v":"00:00:00"},{"$f":"Usage!$E70","v":"00:00:00"},{"$f":"Usage!$F70","v":0},{"$f":"Usage!$G70","v":0},{"$f":"Usage!$H70","v":0},{"$f":"Usage!$L70","v":0},{"$f":"Account!$AI$2","v":0},{"$f":"Usage!$N70","v":0},{"$f":"Usage!$M70","v":0},{"$f":"Account!$AH$2","v":0},{"$f":"Usage!$O70","v":0},0,{"$f":"Tenant!$H70","v":0},{"$f":"Account!$Y$2/100","v":0},{"$f":"Usage!$R70","v":0},{"$f":"Account!$X$2/100","v":0},{"$f":"Usage!$S70","v":0},{"$f":"Tenant!$I70","v":0},{"$f":"Usage!$V70","v":0},{"$f":"Account!$AB$2","v":0},{"$f":"Usage!$X70","v":0},{"$f":"Usage!$W70","v":0},{"$f":"Account!$AA$2","v":0},{"$f":"Usage!$Y70","v":0},{"$f":"Usage!$Z70","v":0},0]
[{"$f":"Tenant!$A71","v":70},{"$f":"Account!$C$2","v":0},{"$f":"Account!$I$2","v":0},{"$f":"Tenant!$B71","v":0},{"$f":"Tenant!$C71","v":0},{"$f":"Tenant!$D71","v":0},{"$f":"Tenant!$E71","v":0},{"$f":"Tenant!$G71","v":0},{"$f":"Usage!$D71","v":"00:00:00"},{"$f":"Usage!$E71","v":"00:00:00"},{"$f":"Usage!$F71","v":0},{"$f":"Usage!$G71","v":0},{"$f":"Usage!$H71","v":0},{"$f":"Usage!$L71","v":0},{"$f":"Account!$AI$2","v":0},{"$f":"Usage!$N71","v":0},{"$f":"Usage!$M71","v":0},{"$f":"Account!$AH$2","v":0},{"$f":"Usage!$O71","v":0},0,{"$f":"Tenant!$H71","v":0},{"$f":"Account!$Y$2/100","v":0},{"$f":"Usage!$R71","v":0},{"$f":"Account!$X$2/100","v":0},{"$f":"Usage!$S71","v":0},{"$f":"Tenant!$I71","v":0},{"$f":"Usage!$V71","v":0},{"$f":"Account!$AB$2","v":0},{"$f":"Usage!$X71","v":0},{"$f":"Usage!$W71","v":0},{"$f":"Account!$AA$2","v":0},{"$f":"Usage!$Y71","v":0},{"$f":"Usage!$Z71","v":0},0]
[{"$f":"Tenant!$A72","v":71},{"$f":"Account!$C$2","v":0},{"$f":"Account!$I$2","v":0},{"$f":"Tenant!$B72","v":0},{"$f":"Tenant!$C72","v":0},{"$f":"Tenant!$D72","v":0},{"$f":"Tenant!$E72","v":0},{"$f":"Tenant!$G72","v":0},{"$f":"Usage!$D72","v":"00:00:00"},{"$f":"Usage!$E72","v":"00:00:00"},{"$f":"Usage!$F72","v":0},{"$f":"Usage!$G72","v":0},{"$f":"Usage!$H72","v":0},{"$f":"Usage!$L72","v":0},{"$f":"Account!$AI$2","v":0},{"$f":"Usage!$N72","v":0},{"$f":"Usage!$M72","v":0},{"$f":"Account!$AH$2","v":0},{"$f":"Usage!$O72","v":0},0,{"$f":"Tenant!$H72","v":0},{"$f":"Account!$Y$2/100","v":0},{"$f":"Usage!$R72","v":0},{"$f":"Account!$X$2/100","v":0},{"$f":"Usage!$S72","v":0},{"$f":"Tenant!$I72","v":0},{"$f":"Usage!$V72","v":0},{"$f":"Account!$AB$2","v":0},{"$f":"Usage!$X72","v":0},{"$f":"Usage!$W72","v":0},{"$f":"Account!$AA$2","v":0},{"$f":"Usage!$Y72","v":0},{"$f":"Usage!$Z72","v":0},0]
[{"$f":"Tenant!$A73","v":72},{"$f":"Account!$C$2","v":0},{"$f":"Account!$I$2","v":0},{"$f":"Tenant!$B73","v":0},{"$f":"Tenant!$C73","v":0},{"$f":"Tenant!$D73","v":0},{"$f":"Tenant!$E73","v":0},{"$f":"Tenant!$G73","v":0},{"$f":"Usage!$D73","v":"00:00:00"},{"$f":"Usage!$E73","v":"00:00:00"},{"$f":"Usage!$F73","v":0},{"$f":"Usage!$G73","v":0},{"$f":"Usage!$H73","v":0},{"$f":"Usage!$L73","v":0},{"$f":"Account!$AI$2","v":0},{"$f":"Usage!$N73","v":0},{"$f":"Usage!$M73","v":0},{"$f":"Account!$AH$2","v":0},{"$f":"Usage!$O73","v":0},0,{"$f":"Tenant!$H73","v":0},{"$f":"Account!$Y$2/100","v":0},{"$f":"Usage!$R73","v":0},{"$f":"Account!$X$2/100","v":0},{"$f":"Usage!$S73","v":0},{"$f":"Tenant!$I73","v":0},{"$f":"Usage!$V73","v":0},{"$f":"Account!$AB$2","v":0},{"$f":"Usage!$X73","v":0},{"$f":"Usage!$W73","v":0},{"$f":"Account!$AA$2","v":0},{"$f":"Usage!$Y73","v":0},{"$f":"Usage!$Z73","v":0},0]
[{"$f":"Tenant!$A74","v":73},{"$f":"Account!$C$2","v":0},{"$f":"Account!$I$2","v":0},{"$f":"Tenant!$B74","v":0},{"$f":"Tenant!$C74","v":0},{"$f":"Tenant!$D74","v":0},{"$f":"Tenant!$E74","v":0},{"$f":"Tenant!$G74","v":0},{"$f":"Usage!$D74","v":"00:00:00"},{"$f":"Usage!$E74","v":"00:00:00"},{"$f":"Usage!$F74","v":0},{"$f":"Usage!$G74","v":0},{"$f":"Usage!$H74","v":0},{"$f":"Usage!$L74","v":0},{"$f":"Account!$AI$2","v":0},{"$f":"Usage!$N74","v":0},{"$f":"Usage!$M74","v":0},{"$f":"Account!$AH$2","v":0},{"$f":"Usage!$O74","v":0},0,{"$f":"Tenant!$H74","v":0},{"$f":"Account!$Y$2/100","v":0},{"$f":"Usage!$R74","v":0},{"$f":"Account!$X$2/100","v":0},{"$f":"Usage!$S74","v":0},{"$f":"Tenant!$I74","v":0},{"$f":"Usage!$V74","v":0},{"$f":"Account!$AB$2","v":0},{"$f":"Usage!$X74","v":0},{"$f":"Usage!$W74","v":0},{"$f":"Account!$AA$2","v":0},{"$f":"Usage!$Y74","v":0},{"$f":"Usage!$Z74","v":0},0]
[{"$f":"Tenant!$A75","v":74},{"$f":"Account!$C$2","v":0},{"$f":"Account!$I$2","v":0},{"$f":"Tenant!$B75","v":0},{"$f":"Tenant!$C75","v":0},{"$f":"Tenant!$D75","v":0},{"$f":"Tenant!$E75","v":0},{"$f":"Tenant!$G75","v":0},{"$f":"Usage!$D75","v":"00:00:00"},{"$f":"Usage!$E75","v":"00:00:00"},{"$f":"Usage!$F75","v":0},{"$f":"Usage!$G75","v":0},{"$f":"Usage!$H75","v":0},{"$f":"Usage!$L75","v":0},{"$f":"Account!$AI$2","v":0},{"$f":"Usage!$N75","v":0},{"$f":"Usage!$M75","v":0},{"$f":"Account!$AH$2","v":0},{"$f":"Usage!$O75","v":0},0,{"$f":"Tenant!$H75","v":0},{"$f":"Account!$Y$2/100","v":0},{"$f":"Usage!$R75","v":0},{"$f":"Account!$X$2/100","v":0},{"$f":"Usage!$S75","v":0},{"$f":"Tenant!$I75","v":0},{"$f":"Usage!$V75","v":0},{"$f":"Account!$AB$2","v":0},{"$f":"Usage!$X75","v":0},{"$f":"Usage!$W75","v":0},{"$f":"Account!$AA$2","v":0},{"$f":"Usage!$Y75","v":0},{"$f":"Usage!$Z75","v":0},0]
[{"$f":"Tenant!$A76","v":75},{"$f":"Account!$C$2","v":0},{"$f":"Account!$I$2","v":0},{"$f":"Tenant!$B76","v":0},{"$f":"Tenant!$C76","v":0},{"$f":"Tenant!$D76","v":0},{"$f":"Tenant!$E76","v":0},{"$f":"Tenant!$G76","v":0},{"$f":"Usage!$D76","v":"00:00:00"},{"$f":"Usage!$E76","v":"00:00:00"},{"$f":"Usage!$F76","v":0},{"$f":"Usage!$G76","v":0},{"$f":"Usage!$H76","v":0},{"$f":"Usage!$L76","v":0},{"$f":"Account!$AI$2","v":0},{"$f":"Usage!$N76","v":0},{"$f":"Usage!$M76","v":0},{"$f":"Account!$AH$2","v":0},{"$f":"Usage!$O76","v":0},0,{"$f":"Tenant!$H76","v":0},{"$f":"Account!$Y$2/100","v":0},{"$f":"Usage!$R76","v":0},{"$f":"Account!$X$2/100","v":0},{"$f":"Usage!$S76","v":0},{"$f":"Tenant!$I76","v":0},{"$f":"Usage!$V76","v":0},{"$f":"Account!$AB$2","v":0},{"$f":"Usage!$X76","v":0},{"$f":"Usage!$W76","v":0},{"$f":"Account!$AA$2","v":0},{"$f":"Usage!$Y76","v":0},{"$f":"Usage!$Z76","v":0},0]
[{"$f":"Tenant!$A77","v":76},{"$f":"Account!$C$2","v":0},{"$f":"Account!$I$2","v":0},{"$f":"Tenant!$B77","v":0},{"$f":"Tenant!$C77","v":0},{"$f":"Tenant!$D77","v":0},{"$f":"Tenant!$E77","v":0},{"$f":"Tenant!$G77","v":0},{"$f":"Usage!$D77","v":"00:00:00"},{"$f":"Usage!$E77","v":"00:00:00"},{"$f":"Usage!$F77","v":0},{"$f":"Usage!$G77","v":0},{"$f":"Usage!$H77","v":0},{"$f":"Usage!$L77","v":0},{"$f":"Account!$AI$2","v":0},{"$f":"Usage!$N77","v":0},{"$f":"Usage!$M77","v":0},{"$f":"Account!$AH$2","v":0},{"$f":"Usage!$O77","v":0},0,{"$f":"Tenant!$H77","v":0},{"$f":"Account!$Y$2/100","v":0},{"$f":"Usage!$R77","v":0},{"$f":"Account!$X$2/100","v":0},{"$f":"Usage!$S77","v":0},{"$f":"Tenant!$I77","v":0},{"$f":"Usage!$V77","v":0},{"$f":"Account!$AB$2","v":0},{"$f":"Usage!$X77","v":0},{"$f":"Usage!$W77","v":0},{"$f":"Account!$AA$2","v":0},{"$f":"Usage!$Y77","v":0},{"$f":"Usage!$Z77","v":0},0]
[{"$f":"Tenant!$A78","v":77},{"$f":"Account!$C$2","v":0},{"$f":"Account!$I$2","v":0},{"$f":"Tenant!$B78","v":0},{"$f":"Tenant!$C78","v":0},{"$f":"Tenant!$D78","v":0},{"$f":"Tenant!$E78","v":0},{"$f":"Tenant!$G78","v":0},{"$f":"Usage!$D78","v":"00:00:00"},{"$f":"Usage!$E78","v":"00:00:00"},{"$f":"Usage!$F78","v":0},{"$f":"Usage!$G78","v":0},{"$f":"Usage!$H78","v":0},{"$f":"Usage!$L78","v":0},{"$f":"Account!$AI$2","v":0},{"$f":"Usage!$N78","v":0},{"$f":"Usage!$M78","v":0},{"$f":"Account!$AH$2","v":0},{"$f":"Usage!$O78","v":0},0,{"$f":"Tenant!$H78","v":0},{"$f":"Account!$Y$2/100","v":0},{"$f":"Usage!$R78","v":0},{"$f":"Account!$X$2/100","v":0},{"$f":"Usage!$S78","v":0},{"$f":"Tenant!$I78","v":0},{"$f":"Usage!$V78","v":0},{"$f":"Account!$AB$2","v":0},{"$f":"Usage!$X78","v":0},{"$f":"Usage!$W78","v":0},{"$f":"Account!$AA$2","v":0},{"$f":"Usage!$Y78","v":0},{"$f":"Usage!$Z78","v":0},0]
[{"$f":"Tenant!$A79","v":78},{"$f":"Account!$C$2","v":0},{"$f":"Account!$I$2","v":0},{"$f":"Tenant!$B79","v":0},{"$f":"Tenant!$C79","v":0},{"$f":"Tenant!$D79","v":0},{"$f":"Tenant!$E79","v":0},{"$f":"Tenant!$G79","v":0},{"$f":"Usage!$D79","v":"00:00:00"},{"$f":"Usage!$E79","v":"00:00:00"},{"$f":"Usage!$F79","v":0},{"$f":"Usage!$G79","v":0},{"$f":"Usage!$H79","v":0},{"$f":"Usage!$L79","v":0},{"$f":"Account!$AI$2","v":0},{"$f":"Usage!$N79","v":0},{"$f":"Usage!$M79","v":0},{"$f":"Account!$AH$2","v":0},{"$f":"Usage!$O79","v":0},0,{"$f":"Tenant!$H79","v":0},{"$f":"Account!$Y$2/100","v":0},{"$f":"Usage!$R79","v":0},{"$f":"Account!$X$2/100","v":0},{"$f":"Usage!$S79","v":0},{"$f":"Tenant!$I79","v":0},{"$f":"Usage!$V79","v":0},{"$f":"Account!$AB$2","v":0},{"$f":"Usage!$X79","v":0},{"$f":"Usage!$W79","v":0},{"$f":"Account!$AA$2","v":0},{"$f":"Usage!$Y79","v":0},{"$f":"Usage!$Z79","v":0},0]
[{"$f":"Tenant!$A80","v":79},{"$f":"Account!$C$2","v":0},{"$f":"Account!$I$2","v":0},{"$f":"Tenant!$B80","v":0},{"$f":"Tenant!$C80","v":0},{"$f":"Tenant!$D80","v":0},{"$f":"Tenant!$E80","v":0},{"$f":"Tenant!$G80","v":0},{"$f":"Usage!$D80","v":"00:00:00"},{"$f":"Usage!$E80","v":"00:00:00"},{"$f":"Usage!$F80","v":0},{"$f":"Usage!$G80","v":0},{"$f":"Usage!$H80","v":0},{"$f":"Usage!$L80","v":0},{"$f":"Account!$AI$2","v":0},{"$f":"Usage!$N80","v":0},{"$f":"Usage!$M80","v":0},{"$f":"Account!$AH$2","v":0},{"$f":"Usage!$O80","v":0},0,{"$f":"Tenant!$H80","v":0},{"$f":"Account!$Y$2/100","v":0},{"$f":"Usage!$R80","v":0},{"$f":"Account!$X$2/100","v":0},{"$f":"Usage!$S80","v":0},{"$f":"Tenant!$I80","v":0},{"$f":"Usage!$V80","v":0},{"$f":"Account!$AB$2","v":0},{"$f":"Usage!$X80","v":0},{"$f":"Usage!$W80","v":0},{"$f":"Account!$AA$2","v":0},{"$f":"Usage!$Y80","v":0},{"$f":"Usage!$Z80","v":0},0]
[{"$f":"Tenant!$A81","v":80},{"$f":"Account!$C$2","v":0},{"$f":"Account!$I$2","v":0},{"$f":"Tenant!$B81","v":0},{"$f":"Tenant!$C81","v":0},{"$f":"Tenant!$D81","v":0},{"$f":"Tenant!$E81","v":0},{"$f":"Tenant!$G81","v":0},{"$f":"Usage!$D81","v":"00:00:00"},{"$f":"Usage!$E81","v":"00:00:00"},{"$f":"Usage!$F81","v":0},{"$f":"Usage!$G81","v":0},{"$f":"Usage!$H81","v":0},{"$f":"Usage!$L81","v":0},{"$f":"Account!$AI$2","v":0},{"$f":"Usage!$N81","v":0},{"$f":"Usage!$M81","v":0},{"$f":"Account!$AH$2","v":0},{"$f":"Usage!$O81","v":0},0,{"$f":"Tenant!$H81","v":0},{"$f":"Account!$Y$2/100","v":0},{"$f":"Usage!$R81","v":0},{"$f":"Account!$X$2/100","v":0},{"$f":"Usage!$S81","v":0},{"$f":"Tenant!$I81","v":0},{"$f":"Usage!$V81","v":0},{"$f":"Account!$AB$2","v":0},{"$f":"Usage!$X81","v":0},{"$f":"Usage!$W81","v":0},{"$f":"Account!$AA$2","v":0},{"$f":"Usage!$Y81","v":0},{"$f":"Usage!$Z81","v":0},0]
[{"$f":"Tenant!$A82","v":81},{"$f":"Account!$C$2","v":0},{"$f":"Account!$I$2","v":0},{"$f":"Tenant!$B82","v":0},{"$f":"Tenant!$C82","v":0},{"$f":"Tenant!$D82","v":0},{"$f":"Tenant!$E82","v":0},{"$f":"Tenant!$G82","v":0},{"$f":"Usage!$D82","v":"00:00:00"},{"$f":"Usage!$E82","v":"00:00:00"},{"$f":"Usage!$F82","v":0},{"$f":"Usage!$G82","v":0},{"$f":"Usage!$H82","v":0},{"$f":"Usage!$L82","v":0},{"$f":"Account!$AI$2","v":0},{"$f":"Usage!$N82","v":0},{"$f":"Usage!$M82","v":0},{"$f":"Account!$AH$2","v":0},{"$f":"Usage!$O82","v":0},0,{"$f":"Tenant!$H82","v":0},{"$f":"Account!$Y$2/100","v":0},{"$f":"Usage!$R82","v":0},{"$f":"Account!$X$2/100","v":0},{"$f":"Usage!$S82","v":0},{"$f":"Tenant!$I82","v":0},{"$f":"Usage!$V82","v":0},{"$f":"Account!$AB$2","v":0},{"$f":"Usage!$X82","v":0},{"$f":"Usage!$W82","v":0},{"$f":"Account!$AA$2","v":0},{"$f":"Usage!$Y82","v":0},{"$f":"Usage!$Z82","v":0},0]
[{"$f":"Tenant!$A83","v":82},{"$f":"Account!$C$2","v":0},{"$f":"Account!$I$2","v":0},{"$f":"Tenant!$B83","v":0},{"$f":"Tenant!$C83","v":0},{"$f":"Tenant!$D83","v":0},{"$f":"Tenant!$E83","v":0},{"$f":"Tenant!$G83","v":0},{"$f":"Usage!$D83","v":"00:00:00"},{"$f":"Usage!$E83","v":"00:00:00"},{"$f":"Usage!$F83","v":0},{"$f":"Usage!$G83","v":0},{"$f":"Usage!$H83","v":0},{"$f":"Usage!$L83","v":0},{"$f":"Account!$AI$2","v":0},{"$f":"Usage!$N83","v":0},{"$f":"Usage!$M83","v":0},{"$f":"Account!$AH$2","v":0},{"$f":"Usage!$O83","v":0},0,{"$f":"Tenant!$H83","v":0},{"$f":"Account!$Y$2/100","v":0},{"$f":"Usage!$R83","v":0},{"$f":"Account!$X$2/100","v":0},{"$f":"Usage!$S83","v":0},{"$f":"Tenant!$I83","v":0},{"$f":"Usage!$V83","v":0},{"$f":"Account!$AB$2","v":0},{"$f":"Usage!$X83","v":0},{"$f":"Usage!$W83","v":0},{"$f":"Account!$AA$2","v":0},{"$f":"Usage!$Y83","v":0},{"$f":"Usage!$Z83","v":0},0]
[{"$f":"Tenant!$A84","v":83},{"$f":"Account!$C$2","v":0},{"$f":"Account!$I$2","v":0},{"$f":"Tenant!$B84","v":0},{"$f":"Tenant!$C84","v":0},{"$f":"Tenant!$D84","v":0},{"$f":"Tenant!$E84","v":0},{"$f":"Tenant!$G84","v":0},{"$f":"Usage!$D84","v":"00:00:00"},{"$f":"Usage!$E84","v":"00:00:00"},{"$f":"Usage!$F84","v":0},{"$f":"Usage!$G84","v":0},{"$f":"Usage!$H84","v":0},{"$f":"Usage!$L84","v":0},{"$f":"Account!$AI$2","v":0},{"$f":"Usage!$N84","v":0},{"$f":"Usage!$M84","v":0},{"$f":"Account!$AH$2","v":0},{"$f":"Usage!$O84","v":0},0,{"$f":"Tenant!$H84","v":0},{"$f":"Account!$Y$2/100","v":0},{"$f":"Usage!$R84","v":0},{"$f":"Account!$X$2/100","v":0},{"$f":"Usage!$S84","v":0},{"$f":"Tenant!$I84","v":0},{"$f":"Usage!$V84","v":0},{"$f":"Account!$AB$2","v":0},{"$f":"Usage!$X84","v":0},{"$f":"Usage!$W84","v":0},{"$f":"Account!$AA$2","v":0},{"$f":"Usage!$Y84","v":0},{"$f":"Usage!$Z84","v":0},0]
[{"$f":"Tenant!$A85","v":84},{"$f":"Account!$C$2","v":0},{"$f":"Account!$I$2","v":0},{"$f":"Tenant!$B85","v":0},{"$f":"Tenant!$C85","v":0},{"$f":"Tenant!$D85","v":0},{"$f":"Tenant!$E85","v":0},{"$f":"Tenant!$G85","v":0},{"$f":"Usage!$D85","v":"00:00:00"},{"$f":"Usage!$E85","v":"00:00:00"},{"$f":"Usage!$F85","v":0},{"$f":"Usage!$G85","v":0},{"$f":"Usage!$H85","v":0},{"$f":"Usage!$L85","v":0},{"$f":"Account!$AI$2","v":0},{"$f":"Usage!$N85","v":0},{"$f":"Usage!$M85","v":0},{"$f":"Account!$AH$2","v":0},{"$f":"Usage!$O85","v":0},0,{"$f":"Tenant!$H85","v":0},{"$f":"Account!$Y$2/100","v":0},{"$f":"Usage!$R85","v":0},{"$f":"Account!$X$2/100","v":0},{"$f":"Usage!$S85","v":0},{"$f":"Tenant!$I85","v":0},{"$f":"Usage!$V85","v":0},{"$f":"Account!$AB$2","v":0},{"$f":"Usage!$X85","v":0},{"$f":"Usage!$W85","v":0},{"$f":"Account!$AA$2","v":0},{"$f":"Usage!$Y85","v":0},{"$f":"Usage!$Z85","v":0},0]
[{"$f":"Tenant!$A86","v":85},{"$f":"Account!$C$2","v":0},{"$f":"Account!$I$2","v":0},{"$f":"Tenant!$B86","v":0},{"$f":"Tenant!$C86","v":0},{"$f":"Tenant!$D86","v":0},{"$f":"Tenant!$E86","v":0},{"$f":"Tenant!$G86","v":0},{"$f":"Usage!$D86","v":"00:00:00"},{"$f":"Usage!$E86","v":"00:00:00"},{"$f":"Usage!$F86","v":0},{"$f":"Usage!$G86","v":0},{"$f":"Usage!$H86","v":0},{"$f":"Usage!$L86","v":0},{"$f":"Account!$AI$2","v":0},{"$f":"Usage!$N86","v":0},{"$f":"Usage!$M86","v":0},{"$f":"Account!$AH$2","v":0},{"$f":"Usage!$O86","v":0},0,{"$f":"Tenant!$H86","v":0},{"$f":"Account!$Y$2/100","v":0},{"$f":"Usage!$R86","v":0},{"$f":"Account!$X$2/100","v":0},{"$f":"Usage!$S86","v":0},{"$f":"Tenant!$I86","v":0},{"$f":"Usage!$V86","v":0},{"$f":"Account!$AB$2","v":0},{"$f":"Usage!$X86","v":0},{"$f":"Usage!$W86","v":0},{"$f":"Account!$AA$2","v":0},{"$f":"Usage!$Y86","v":0},{"$f":"Usage!$Z86","v":0},0]
[{"$f":"Tenant!$A87","v":86},{"$f":"Account!$C$2","v":0},{"$f":"Account!$I$2","v":0},{"$f":"Tenant!$B87","v":0},{"$f":"Tenant!$C87","v":0},{"$f":"Tenant!$D87","v":0},{"$f":"Tenant!$E87","v":0},{"$f":"Tenant!$G87","v":0},{"$f":"Usage!$D87","v":"00:00:00"},{"$f":"Usage!$E87","v":"00:00:00"},{"$f":"Usage!$F87","v":0},{"$f":"Usage!$G87","v":0},{"$f":"Usage!$H87","v":0},{"$f":"Usage!$L87","v":0},{"$f":"Account!$AI$2","v":0},{"$f":"Usage!$N87","v":0},{"$f":"Usage!$M87","v":0},{"$f":"Account!$AH$2","v":0},{"$f":"Usage!$O87","v":0},0,{"$f":"Tenant!$H87","v":0},{"$f":"Account!$Y$2/100","v":0},{"$f":"Usage!$R87","v":0},{"$f":"Account!$X$2/100","v":0},{"$f":"Usage!$S87","v":0},{"$f":"Tenant!$I87","v":0},{"$f":"Usage!$V87","v":0},{"$f":"Account!$AB$2","v":0},{"$f":"Usage!$X87","v":0},{"$f":"Usage!$W87","v":0},{"$f":"Account!$AA$2","v":0},{"$f":"Usage!$Y87","v":0},{"$f":"Usage!$Z87","v":0},0]
[{"$f":"Tenant!$A88","v":87},{"$f":"Account!$C$2","v":0},{"$f":"Account!$I$2","v":0},{"$f":"Tenant!$B88","v":0},{"$f":"Tenant!$C88","v":0},{"$f":"Tenant!$D88","v":0},{"$f":"Tenant!$E88","v":0},{"$f":"Tenant!$G88","v":0},{"$f":"Usage!$D88","v":"00:00:00"},{"$f":"Usage!$E88","v":"00:00:00"},{"$f":"Usage!$F88","v":0},{"$f":"Usage!$G88","v":0},{"$f":"Usage!$H88","v":0},{"$f":"Usage!$L88","v":0},{"$f":"Account!$AI$2","v":0},{"$f":"Usage!$N88","v":0},{"$f":"Usage!$M88","v":0},{"$f":"Account!$AH$2","v":0},{"$f":"Usage!$O88","v":0},0,{"$f":"Tenant!$H88","v":0},{"$f":"Account!$Y$2/100","v":0},{"$f":"Usage!$R88","v":0},{"$f":"Account!$X$2/100","v":0},{"$f":"Usage!$S88","v":0},{"$f":"Tenant!$I88","v":0},{"$f":"Usage!$V88","v":0},{"$f":"Account!$AB$2","v":0},{"$f":"Usage!$X88","v":0},{"$f":"Usage!$W88","v":0},{"$f":"Account!$AA$2","v":0},{"$f":"Usage!$Y88","v":0},{"$f":"Usage!$Z88","v":0},0]
[{"$f":"Tenant!$A89","v":88},{"$f":"Account!$C$2","v":0},{"$f":"Account!$I$2","v":0},{"$f":"Tenant!$B89","v":0},{"$f":"Tenant!$C89","v":0},{"$f":"Tenant!$D89","v":0},{"$f":"Tenant!$E89","v":0},{"$f":"Tenant!$G89","v":0},{"$f":"Usage!$D89","v":"00:00:00"},{"$f":"Usage!$E89","v":"00:00:00"},{"$f":"Usage!$F89","v":0},{"$f":"Usage!$G89","v":0},{"$f":"Usage!$H89","v":0},{"$f":"Usage!$L89","v":0},{"$f":"Account!$AI$2","v":0},{"$f":"Usage!$N89","v":0},{"$f":"Usage!$M89","v":0},{"$f":"Account!$AH$2","v":0},{"$f":"Usage!$O89","v":0},0,{"$f":"Tenant!$H89","v":0},{"$f":"Account!$Y$2/100","v":0},{"$f":"Usage!$R89","v":0},{"$f":"Account!$X$2/100","v":0},{"$f":"Usage!$S89","v":0},{"$f":"Tenant!$I89","v":0},{"$f":"Usage!$V89","v":0},{"$f":"Account!$AB$2","v":0},{"$f":"Usage!$X89","v":0},{"$f":"Usage!$W89","v":0},{"$f":"Account!$AA$2","v":0},{"$f":"Usage!$Y89","v":0},{"$f":"Usage!$Z89","v":0},0]
[{"$f":"Tenant!$A90","v":89},{"$f":"Account!$C$2","v":0},{"$f":"Account!$I$2","v":0},{"$f":"Tenant!$B90","v":0},{"$f":"Tenant!$C90","v":0},{"$f":"Tenant!$D90","v":0},{"$f":"Tenant!$E90","v":0},{"$f":"Tenant!$G90","v":0},{"$f":"Usage!$D90","v":"00:00:00"},{"$f":"Usage!$E90","v":"00:00:00"},{"$f":"Usage!$F90","v":0},{"$f":"Usage!$G90","v":0},{"$f":"Usage!$H90","v":0},{"$f":"Usage!$L90","v":0},{"$f":"Account!$AI$2","v":0},{"$f":"Usage!$N90","v":0},{"$f":"Usage!$M90","v":0},{"$f":"Account!$AH$2","v":0},{"$f":"Usage!$O90","v":0},0,{"$f":"Tenant!$H90","v":0},{"$f":"Account!$Y$2/100","v":0},{"$f":"Usage!$R90","v":0},{"$f":"Account!$X$2/100","v":0},{"$f":"Usage!$S90","v":0},{"$f":"Tenant!$I90","v":0},{"$f":"Usage!$V90","v":0},{"$f":"Account!$AB$2","v":0},{"$f":"Usage!$X90","v":0},{"$f":"Usage!$W90","v":0},{"$f":"Account!$AA$2","v":0},{"$f":"Usage!$Y90","v":0},{"$f":"Usage!$Z90","v":0},0]
[{"$f":"Tenant!$A91","v":90},{"$f":"Account!$C$2","v":0},{"$f":"Account!$I$2","v":0},{"$f":"Tenant!$B91","v":0},{"$f":"Tenant!$C91","v":0},{"$f":"Tenant!$D91","v":0},{"$f":"Tenant!$E91","v":0},{"$f":"Tenant!$G91","v":0},{"$f":"Usage!$D91","v":"00:00:00"},{"$f":"Usage!$E91","v":"00:00:00"},{"$f":"Usage!$F91","v":0},{"$f":"Usage!$G91","v":0},{"$f":"Usage!$H91","v":0},{"$f":"Usage!$L91","v":0},{"$f":"Account!$AI$2","v":0},{"$f":"Usage!$N91","v":0},{"$f":"Usage!$M91","v":0},{"$f":"Account!$AH$2","v":0},{"$f":"Usage!$O91","v":0},0,{"$f":"Tenant!$H91","v":0},{"$f":"Account!$Y$2/100","v":0},{"$f":"Usage!$R91","v":0},{"$f":"Account!$X$2/100","v":0},{"$f":"Usage!$S91","v":0},{"$f":"Tenant!$I91","v":0},{"$f":"Usage!$V91","v":0},{"$f":"Account!$AB$2","v":0},{"$f":"Usage!$X91","v":0},{"$f":"Usage!$W91","v":0},{"$f":"Account!$AA$2","v":0},{"$f":"Usage!$Y91","v":0},{"$f":"Usage!$Z91","v":0},0]
[{"$f":"Tenant!$A92","v":91},{"$f":"Account!$C$2","v":0},{"$f":"Account!$I$2","v":0},{"$f":"Tenant!$B92","v":0},{"$f":"Tenant!$C92","v":0},{"$f":"Tenant!$D92","v":0},{"$f":"Tenant!$E92","v":0},{"$f":"Tenant!$G92","v":0},{"$f":"Usage!$D92","v":"00:00:00"},{"$f":"Usage!$E92","v":"00:00:00"},{"$f":"Usage!$F92","v":0},{"$f":"Usage!$G92","v":0},{"$f":"Usage!$H92","v":0},{"$f":"Usage!$L92","v":0},{"$f":"Account!$AI$2","v":0},{"$f":"Usage!$N92","v":0},{"$f":"Usage!$M92","v":0},{"$f":"Account!$AH$2","v":0},{"$f":"Usage!$O92","v":0},0,{"$f":"Tenant!$H92","v":0},{"$f":"Account!$Y$2/100","v":0},{"$f":"Usage!$R92","v":0},{"$f":"Account!$X$2/100","v":0},{"$f":"Usage!$S92","v":0},{"$f":"Tenant!$I92","v":0},{"$f":"Usage!$V92","v":0},{"$f":"Account!$AB$2","v":0},{"$f":"Usage!$X92","v":0},{"$f":"Usage!$W92","v":0},{"$f":"Account!$AA$2","v":0},{"$f":"Usage!$Y92","v":0},{"$f":"Usage!$Z92","v":0},0]
[{"$f":"Tenant!$A93","v":92},{"$f":"Account!$C$2","v":0},{"$f":"Account!$I$2","v":0},{"$f":"Tenant!$B93","v":0},{"$f":"Tenant!$C93","v":0},{"$f":"Tenant!$D93","v":0},{"$f":"Tenant!$E93","v":0},{"$f":"Tenant!$G93","v":0},{"$f":"Usage!$D93","v":"00:00:00"},{"$f":"Usage!$E93","v":"00:00:00"},{"$f":"Usage!$F93","v":0},{"$f":"Usage!$G93","v":0},{"$f":"Usage!$H93","v":0},{"$f":"Usage!$L93","v":0},{"$f":"Account!$AI$2","v":0},{"$f":"Usage!$N93","v":0},{"$f":"Usage!$M93","v":0},{"$f":"Account!$AH$2","v":0},{"$f":"Usage!$O93","v":0},0,{"$f":"Tenant!$H93","v":0},{"$f":"Account!$Y$2/100","v":0},{"$f":"Usage!$R93","v":0},{"$f":"Account!$X$2/100","v":0},{"$f":"Usage!$S93","v":0},{"$f":"Tenant!$I93","v":0},{"$f":"Usage!$V93","v":0},{"$f":"Account!$AB$2","v":0},{"$f":"Usage!$X93","v":0},{"$f":"Usage!$W93","v":0},{"$f":"Account!$AA$2","v":0},{"$f":"Usage!$Y93","v":0},{"$f":"Usage!$Z93","v":0},0]
[{"$f":"Tenant!$A94","v":93},{"$f":"Account!$C$2","v":0},{"$f":"Account!$I$2","v":0},{"$f":"Tenant!$B94","v":0},{"$f":"Tenant!$C94","v":0},{"$f":"Tenant!$D94","v":0},{"$f":"Tenant!$E94","v":0},{"$f":"Tenant!$G94","v":0},{"$f":"Usage!$D94","v":"00:00:00"},{"$f":"Usage!$E94","v":"00:00:00"},{"$f":"Usage!$F94","v":0},{"$f":"Usage!$G94","v":0},{"$f":"Usage!$H94","v":0},{"$f":"Usage!$L94","v":0},{"$f":"Account!$AI$2","v":0},{"$f":"Usage!$N94","v":0},{"$f":"Usage!$M94","v":0},{"$f":"Account!$AH$2","v":0},{"$f":"Usage!$O94","v":0},0,{"$f":"Tenant!$H94","v":0},{"$f":"Account!$Y$2/100","v":0},{"$f":"Usage!$R94","v":0},{"$f":"Account!$X$2/100","v":0},{"$f":"Usage!$S94","v":0},{"$f":"Tenant!$I94","v":0},{"$f":"Usage!$V94","v":0},{"$f":"Account!$AB$2","v":0},{"$f":"Usage!$X94","v":0},{"$f":"Usage!$W94","v":0},{"$f":"Account!$AA$2","v":0},{"$f":"Usage!$Y94","v":0},{"$f":"Usage!$Z94","v":0},0]
[{"$f":"Tenant!$A95","v":94},{"$f":"Account!$C$2","v":0},{"$f":"Account!$I$2","v":0},{"$f":"Tenant!$B95","v":0},{"$f":"Tenant!$C95","v":0},{"$f":"Tenant!$D95","v":0},{"$f":"Tenant!$E95","v":0},{"$f":"Tenant!$G95","v":0},{"$f":"Usage!$D95","v":"00:00:00"},{"$f":"Usage!$E95","v":"00:00:00"},{"$f":"Usage!$F95","v":0},{"$f":"Usage!$G95","v":0},{"$f":"Usage!$H95","v":0},{"$f":"Usage!$L95","v":0},{"$f":"Account!$AI$2","v":0},{"$f":"Usage!$N95","v":0},{"$f":"Usage!$M95","v":0},{"$f":"Account!$AH$2","v":0},{"$f":"Usage!$O95","v":0},0,{"$f":"Tenant!$H95","v":0},{"$f":"Account!$Y$2/100","v":0},{"$f":"Usage!$R95","v":0},{"$f":"Account!$X$2/100","v":0},{"$f":"Usage!$S95","v":0},{"$f":"Tenant!$I95","v":0},{"$f":"Usage!$V95","v":0},{"$f":"Account!$AB$2","v":0},{"$f":"Usage!$X95","v":0},{"$f":"Usage!$W95","v":0},{"$f":"Account!$AA$2","v":0},{"$f":"Usage!$Y95","v":0},{"$f":"Usage!$Z95","v":0},0]
[{"$f":"Tenant!$A96","v":95},{"$f":"Account!$C$2","v":0},{"$f":"Account!$I$2","v":0},{"$f":"Tenant!$B96","v":0},{"$f":"Tenant!$C96","v":0},{"$f":"Tenant!$D96","v":0},{"$f":"Tenant!$E96","v":0},{"$f":"Tenant!$G96","v":0},{"$f":"Usage!$D96","v":"00:00:00"},{"$f":"Usage!$E96","v":"00:00:00"},{"$f":"Usage!$F96","v":0},{"$f":"Usage!$G96","v":0},{"$f":"Usage!$H96","v":0},{"$f":"Usage!$L96","v":0},{"$f":"Account!$AI$2","v":0},{"$f":"Usage!$N96","v":0},{"$f":"Usage!$M96","v":0},{"$f":"Account!$AH$2","v":0},{"$f":"Usage!$O96","v":0},0,{"$f":"Tenant!$H96","v":0},{"$f":"Account!$Y$2/100","v":0},{"$f":"Usage!$R96","v":0},{"$f":"Account!$X$2/100","v":0},{"$f":"Usage!$S96","v":0},{"$f":"Tenant!$I96","v":0},{"$f":"Usage!$V96","v":0},{"$f":"Account!$AB$2","v":0},{"$f":"Usage!$X96","v":0},{"$f":"Usage!$W96","v":0},{"$f":"Account!$AA$2","v":0},{"$f":"Usage!$Y96","v":0},{"$f":"Usage!$Z96","v":0},0]
[{"$f":"Tenant!$A97","v":96},{"$f":"Account!$C$2","v":0},{"$f":"Account!$I$2","v":0},{"$f":"Tenant!$B97","v":0},{"$f":"Tenant!$C97","v":0},{"$f":"Tenant!$D97","v":0},{"$f":"Tenant!$E97","v":0},{"$f":"Tenant!$G97","v":0},{"$f":"Usage!$D97","v":"00:00:00"},{"$f":"Usage!$E97","v":"00:00:00"},{"$f":"Usage!$F97","v":0},{"$f":"Usage!$G97","v":0},{"$f":"Usage!$H97","v":0},{"$f":"Usage!$L97","v":0},{"$f":"Account!$AI$2","v":0},{"$f":"Usage!$N97","v":0},{"$f":"Usage!$M97","v":0},{"$f":"Account!$AH$2","v":0},{"$f":"Usage!$O97","v":0},0,{"$f":"Tenant!$H97","v":0},{"$f":"Account!$Y$2/100","v":0},{"$f":"Usage!$R97","v":0},{"$f":"Account!$X$2/100","v":0},{"$f":"Usage!$S97","v":0},{"$f":"Tenant!$I97","v":0},{"$f":"Usage!$V97","v":0},{"$f":"Account!$AB$2","v":0},{"$f":"Usage!$X97","v":0},{"$f":"Usage!$W97","v":0},{"$f":"Account!$AA$2","v":0},{"$f":"Usage!$Y97","v":0},{"$f":"Usage!$Z97","v":0},0]
[{"$f":"Tenant!$A98","v":97},{"$f":"Account!$C$2","v":0},{"$f":"Account!$I$2","v":0},{"$f":"Tenant!$B98","v":0},{"$f":"Tenant!$C98","v":0},{"$f":"Tenant!$D98","v":0},{"$f":"Tenant!$E98","v":0},{"$f":"Tenant!$G98","v":0},{"$f":"Usage!$D98","v":"00:00:00"},{"$f":"Usage!$E98","v":"00:00:00"},{"$f":"Usage!$F98","v":0},{"$f":"Usage!$G98","v":0},{"$f":"Usage!$H98","v":0},{"$f":"Usage!$L98","v":0},{"$f":"Account!$AI$2","v":0},{"$f":"Usage!$N98","v":0},{"$f":"Usage!$M98","v":0},{"$f":"Account!$AH$2","v":0},{"$f":"Usage!$O98","v":0},0,{"$f":"Tenant!$H98","v":0},{"$f":"Account!$Y$2/100","v":0},{"$f":"Usage!$R98","v":0},{"$f":"Account!$X$2/100","v":0},{"$f":"Usage!$S98","v":0},{"$f":"Tenant!$I98","v":0},{"$f":"Usage!$V98","v":0},{"$f":"Account!$AB$2","v":0},{"$f":"Usage!$X98","v":0},{"$f":"Usage!$W98","v":0},{"$f":"Account!$AA$2","v":0},{"$f":"Usage!$Y98","v":0},{"$f":"Usage!$Z98","v":0},0]
[{"$f":"Tenant!$A99","v":98},{"$f":"Account!$C$2","v":0},{"$f":"Account!$I$2","v":0},{"$f":"Tenant!$B99","v":0},{"$f":"Tenant!$C99","v":0},{"$f":"Tenant!$D99","v":0},{"$f":"Tenant!$E99","v":0},{"$f":"Tenant!$G99","v":0},{"$f":"Usage!$D99","v":"00:00:00"},{"$f":"Usage!$E99","v":"00:00:00"},{"$f":"Usage!$F99","v":0},{"$f":"Usage!$G99","v":0},{"$f":"Usage!$H99","v":0},{"$f":"Usage!$L99","v":0},{"$f":"Account!$AI$2","v":0},{"$f":"Usage!$N99","v":0},{"$f":"Usage!$M99","v":0},{"$f":"Account!$AH$2","v":0},{"$f":"Usage!$O99","v":0},0,{"$f":"Tenant!$H99","v":0},{"$f":"Account!$Y$2/100","v":0},{"$f":"Usage!$R99","v":0},{"$f":"Account!$X$2/100","v":0},{"$f":"Usage!$S99","v":0},{"$f":"Tenant!$I99","v":0},{"$f":"Usage!$V99","v":0},{"$f":"Account!$AB$2","v":0},{"$f":"Usage!$X99","v":0},{"$f":"Usage!$W99","v":0},{"$f":"Account!$AA$2","v":0},{"$f":"Usage!$Y99","v":0},{"$f":"Usage!$Z99","v":0},0]
[{"$f":"Tenant!$A100","v":99},{"$f":"Account!$C$2","v":0},{"$f":"Account!$I$2","v":0},{"$f":"Tenant!$B100","v":0},{"$f":"Tenant!$C100","v":0},{"$f":"Tenant!$D100","v":0},{"$f":"Tenant!$E100","v":0},{"$f":"Tenant!$G100","v":0},{"$f":"Usage!$D100","v":"00:00:00"},{"$f":"Usage!$E100","v":"00:00:00"},{"$f":"Usage!$F100","v":0},{"$f":"Usage!$G100","v":0},{"$f":"Usage!$H100","v":0},{"$f":"Usage!$L100","v":0},{"$f":"Account!$AI$2","v":0},{"$f":"Usage!$N100","v":0},{"$f":"Usage!$M100","v":0},{"$f":"Account!$AH$2","v":0},{"$f":"Usage!$O100","v":0},0,{"$f":"Tenant!$H100","v":0},{"$f":"Account!$Y$2/100","v":0},{"$f":"Usage!$R100","v":0},{"$f":"Account!$X$2/100","v":0},{"$f":"Usage!$S100","v":0},{"$f":"Tenant!$I100","v":0},{"$f":"Usage!$V100","v":0},{"$f":"Account!$AB$2","v":0},{"$f":"Usage!$X100","v":0},{"$f":"Usage!$W100","v":0},{"$f":"Account!$AA$2","v":0},{"$f":"Usage!$Y100","v":0},{"$f":"Usage!$Z100","v":0},0]
[{"$f":"Tenant!$A101","v":100},{"$f":"Account!$C$2","v":0},{"$f":"Account!$I$2","v":0},{"$f":"Tenant!$B101","v":0},{"$f":"Tenant!$C101","v":0},{"$f":"Tenant!$D101","v":0},{"$f":"Tenant!$E101","v":0},{"$f":"Tenant!$G101","v":0},{"$f":"Usage!$D101","v":"00:00:00"},{"$f":"Usage!$E101","v":"00:00:00"},{"$f":"Usage!$F101","v":0},{"$f":"Usage!$G101","v":0},{"$f":"Usage!$H101","v":0},{"$f":"Usage!$L101","v":0},{"$f":"Account!$AI$2","v":0},{"$f":"Usage!$N101","v":0},{"$f":"Usage!$M101","v":0},{"$f":"Account!$AH$2","v":0},{"$f":"Usage!$O101","v":0},0,{"$f":"Tenant!$H101","v":0},{"$f":"Account!$Y$2/100","v":0},{"$f":"Usage!$R101","v":0},{"$f":"Account!$X$2/100","v":0},{"$f":"Usage!$S101","v":0},{"$f":"Tenant!$I101","v":0},{"$f":"Usage!$V101","v":0},{"$f":"Account!$AB$2","v":0},{"$f":"Usage!$X101","v":0},{"$f":"Usage!$W101","v":0},{"$f":"Account!$AA$2","v":0},{"$f":"Usage!$Y101","v":0},{"$f":"Usage!$Z101","v":0},0]
[{"$f":"Tenant!$A102","v":101},{"$f":"Account!$C$2","v":0},{"$f":"Account!$I$2","v":0},{"$f":"Tenant!$B102","v":0},{"$f":"Tenant!$C102","v":0},{"$f":"Tenant!$D102","v":0},{"$f":"Tenant!$E102","v":0},{"$f":"Tenant!$G102","v":0},{"$f":"Usage!$D102","v":"00:00:00"},{"$f":"Usage!$E102","v":"00:00:00"},{"$f":"Usage!$F102","v":0},{"$f":"Usage!$G102","v":0},{"$f":"Usage!$H102","v":0},{"$f":"Usage!$L102","v":0},{"$f":"Account!$AI$2","v":0},{"$f":"Usage!$N102","v":0},{"$f":"Usage!$M102","v":0},{"$f":"Account!$AH$2","v":0},{"$f":"Usage!$O102","v":0},0,{"$f":"Tenant!$H102","v":0},{"$f":"Account!$Y$2/100","v":0},{"$f":"Usage!$R102","v":0},{"$f":"Account!$X$2/100","v":0},{"$f":"Usage!$S102","v":0},{"$f":"Tenant!$I102","v":0},{"$f":"Usage!$V102","v":0},{"$f":"Account!$AB$2","v":0},{"$f":"Usage!$X102","v":0},{"$f":"Usage!$W102","v":0},{"$f":"Account!$AA$2","v":0},{"$f":"Usage!$Y102","v":0},{"$f":"Usage!$Z102","v":0},0]
[{"$f":"Tenant!$A103","v":102},{"$f":"Account!$C$2","v":0},{"$f":"Account!$I$2","v":0},{"$f":"Tenant!$B103","v":0},{"$f":"Tenant!$C103","v":0},{"$f":"Tenant!$D103","v":0},{"$f":"Tenant!$E103","v":0},{"$f":"Tenant!$G103","v":0},{"$f":"Usage!$D103","v":"00:00:00"},{"$f":"Usage!$E103","v":"00:00:00"},{"$f":"Usage!$F103","v":0},{"$f":"Usage!$G103","v":0},{"$f":"Usage!$H103","v":0},{"$f":"Usage!$L103","v":0},{"$f":"Account!$AI$2","v":0},{"$f":"Usage!$N103","v":0},{"$f":"Usage!$M103","v":0},{"$f":"Account!$AH$2","v":0},{"$f":"Usage!$O103","v":0},0,{"$f":"Tenant!$H103","v":0},{"$f":"Account!$Y$2/100","v":0},{"$f":"Usage!$R103","v":0},{"$f":"Account!$X$2/100","v":0},{"$f":"Usage!$S103","v":0},{"$f":"Tenant!$I103","v":0},{"$f":"Usage!$V103","v":0},{"$f":"Account!$AB$2","v":0},{"$f":"Usage!$X103","v":0},{"$f":"Usage!$W103","v":0},{"$f":"Account!$AA$2","v":0},{"$f":"Usage!$Y103","v":0},{"$f":"Usage!$Z103","v":0},0]
[{"$f":"Tenant!$A104","v":103},{"$f":"Account!$C$2","v":0},{"$f":"Account!$I$2","v":0},{"$f":"Tenant!$B104","v":0},{"$f":"Tenant!$C104","v":0},{"$f":"Tenant!$D104","v":0},{"$f":"Tenant!$E104","v":0},{"$f":"Tenant!$G104","v":0},{"$f":"Usage!$D104","v":"00:00:00"},{"$f":"Usage!$E104","v":"00:00:00"},{"$f":"Usage!$F104","v":0},{"$f":"Usage!$G104","v":0},{"$f":"Usage!$H104","v":0},{"$f":"Usage!$L104","v":0},{"$f":"Account!$AI$2","v":0},{"$f":"Usage!$N104","v":0},{"$f":"Usage!$M104","v":0},{"$f":"Account!$AH$2","v":0},{"$f":"Usage!$O104","v":0},0,{"$f":"Tenant!$H104","v":0},{"$f":"Account!$Y$2/100","v":0},{"$f":"Usage!$R104","v":0},{"$f":"Account!$X$2/100","v":0},{"$f":"Usage!$S104","v":0},{"$f":"Tenant!$I104","v":0},{"$f":"Usage!$V104","v":0},{"$f":"Account!$AB$2","v":0},{"$f":"Usage!$X104","v":0},{"$f":"Usage!$W104","v":0},{"$f":"Account!$AA$2","v":0},{"$f":"Usage!$Y104","v":0},{"$f":"Usage!$Z104","v":0},0]
[{"$f":"Tenant!$A105","v":104},{"$f":"Account!$C$2","v":0},{"$f":"Account!$I$2","v":0},{"$f":"Tenant!$B105","v":0},{"$f":"Tenant!$C105","v":0},{"$f":"Tenant!$D105","v":0},{"$f":"Tenant!$E105","v":0},{"$f":"Tenant!$G105","v":0},{"$f":"Usage!$D105","v":"00:00:00"},{"$f":"Usage!$E105","v":"00:00:00"},{"$f":"Usage!$F105","v":0},{"$f":"Usage!$G105","v":0},{"$f":"Usage!$H105","v":0},{"$f":"Usage!$L105","v":0},{"$f":"Account!$AI$2","v":0},{"$f":"Usage!$N105","v":0},{"$f":"Usage!$M105","v":0},{"$f":"Account!$AH$2","v":0},{"$f":"Usage!$O105","v":0},0,{"$f":"Tenant!$H105","v":0},{"$f":"Account!$Y$2/100","v":0},{"$f":"Usage!$R105","v":0},{"$f":"Account!$X$2/100","v":0},{"$f":"Usage!$S105","v":0},{"$f":"Tenant!$I105","v":0},{"$f":"Usage!$V105","v":0},{"$f":"Account!$AB$2","v":0},{"$f":"Usage!$X105","v":0},{"$f":"Usage!$W105","v":0},{"$f":"Account!$AA$2","v":0},{"$f":"Usage!$Y105","v":0},{"$f":"Usage!$Z105","v":0},0]
[{"$f":"Tenant!$A106","v":105},{"$f":"Account!$C$2","v":0},{"$f":"Account!$I$2","v":0},{"$f":"Tenant!$B106","v":0},{"$f":"Tenant!$C106","v":0},{"$f":"Tenant!$D106","v":0},{"$f":"Tenant!$E106","v":0},{"$f":"Tenant!$G106","v":0},{"$f":"Usage!$D106","v":"00:00:00"},{"$f":"Usage!$E106","v":"00:00:00"},{"$f":"Usage!$F106","v":0},{"$f":"Usage!$G106","v":0},{"$f":"Usage!$H106","v":0},{"$f":"Usage!$L106","v":0},{"$f":"Account!$AI$2","v":0},{"$f":"Usage!$N106","v":0},{"$f":"Usage!$M106","v":0},{"$f":"Account!$AH$2","v":0},{"$f":"Usage!$O106","v":0},0,{"$f":"Tenant!$H106","v":0},{"$f":"Account!$Y$2/100","v":0},{"$f":"Usage!$R106","v":0},{"$f":"Account!$X$2/100","v":0},{"$f":"Usage!$S106","v":0},{"$f":"Tenant!$I106","v":0},{"$f":"Usage!$V106","v":0},{"$f":"Account!$AB$2","v":0},{"$f":"Usage!$X106","v":0},{"$f":"Usage!$W106","v":0},{"$f":"Account!$AA$2","v":0},{"$f":"Usage!$Y106","v":0},{"$f":"Usage!$Z106","v":0},0]
[{"$f":"Tenant!$A107","v":106},{"$f":"Account!$C$2","v":0},{"$f":"Account!$I$2","v":0},{"$f":"Tenant!$B107","v":0},{"$f":"Tenant!$C107","v":0},{"$f":"Tenant!$D107","v":0},{"$f":"Tenant!$E107","v":0},{"$f":"Tenant!$G107","v":0},{"$f":"Usage!$D107","v":"00:00:00"},{"$f":"Usage!$E107","v":"00:00:00"},{"$f":"Usage!$F107","v":0},{"$f":"Usage!$G107","v":0},{"$f":"Usage!$H107","v":0},{"$f":"Usage!$L107","v":0},{"$f":"Account!$AI$2","v":0},{"$f":"Usage!$N107","v":0},{"$f":"Usage!$M107","v":0},{"$f":"Account!$AH$2","v":0},{"$f":"Usage!$O107","v":0},0,{"$f":"Tenant!$H107","v":0},{"$f":"Account!$Y$2/100","v":0},{"$f":"Usage!$R107","v":0},{"$f":"Account!$X$2/100","v":0},{"$f":"Usage!$S107","v":0},{"$f":"Tenant!$I107","v":0},{"$f":"Usage!$V107","v":0},{"$f":"Account!$AB$2","v":0},{"$f":"Usage!$X107","v":0},{"$f":"Usage!$W107","v":0},{"$f":"Account!$AA$2","v":0},{"$f":"Usage!$Y107","v":0},{"$f":"Usage!$Z107","v":0},0]
[{"$f":"Tenant!$A108","v":107},{"$f":"Account!$C$2","v":0},{"$f":"Account!$I$2","v":0},{"$f":"Tenant!$B108","v":0},{"$f":"Tenant!$C108","v":0},{"$f":"Tenant!$D108","v":0},{"$f":"Tenant!$E108","v":0},{"$f":"Tenant!$G108","v":0},{"$f":"Usage!$D108","v":"00:00:00"},{"$f":"Usage!$E108","v":"00:00:00"},{"$f":"Usage!$F108","v":0},{"$f":"Usage!$G108","v":0},{"$f":"Usage!$H108","v":0},{"$f":"Usage!$L108","v":0},{"$f":"Account!$AI$2","v":0},{"$f":"Usage!$N108","v":0},{"$f":"Usage!$M108","v":0},{"$f":"Account!$AH$2","v":0},{"$f":"Usage!$O108","v":0},0,{"$f":"Tenant!$H108","v":0},{"$f":"Account!$Y$2/100","v":0},{"$f":"Usage!$R108","v":0},{"$f":"Account!$X$2/100","v":0},{"$f":"Usage!$S108","v":0},{"$f":"Tenant!$I108","v":0},{"$f":"Usage!$V108","v":0},{"$f":"Account!$AB$2","v":0},{"$f":"Usage!$X108","v":0},{"$f":"Usage!$W108","v":0},{"$f":"Account!$AA$2","v":0},{"$f":"Usage!$Y108","v":0},{"$f":"Usage!$Z108","v":0},0]
[{"$f":"Tenant!$A109","v":108},{"$f":"Account!$C$2","v":0},{"$f":"Account!$I$2","v":0},{"$f":"Tenant!$B109","v":0},{"$f":"Tenant!$C109","v":0},{"$f":"Tenant!$D109","v":0},{"$f":"Tenant!$E109","v":0},{"$f":"Tenant!$G109","v":0},{"$f":"Usage!$D109","v":"00:00:00"},{"$f":"Usage!$E109","v":"00:00:00"},{"$f":"Usage!$F109","v":0},{"$f":"Usage!$G109","v":0},{"$f":"Usage!$H109","v":0},{"$f":"Usage!$L109","v":0},{"$f":"Account!$AI$2","v":0},{"$f":"Usage!$N109","v":0},{"$f":"Usage!$M109","v":0},{"$f":"Account!$AH$2","v":0},{"$f":"Usage!$O109","v":0},0,{"$f":"Tenant!$H109","v":0},{"$f":"Account!$Y$2/100","v":0},{"$f":"Usage!$R109","v":0},{"$f":"Account!$X$2/100","v":0},{"$f":"Usage!$S109","v":0},{"$f":"Tenant!$I109","v":0},{"$f":"Usage!$V109","v":0},{"$f":"Account!$AB$2","v":0},{"$f":"Usage!$X109","v":0},{"$f":"Usage!$W109","v":0},{"$f":"Account!$AA$2","v":0},{"$f":"Usage!$Y109","v":0},{"$f":"Usage!$Z109","v":0},0]
[{"$f":"Tenant!$A110","v":109},{"$f":"Account!$C$2","v":0},{"$f":"Account!$I$2","v":0},{"$f":"Tenant!$B110","v":0},{"$f":"Tenant!$C110","v":0},{"$f":"Tenant!$D110","v":0},{"$f":"Tenant!$E110","v":0},{"$f":"Tenant!$G110","v":0},{"$f":"Usage!$D110","v":"00:00:00"},{"$f":"Usage!$E110","v":"00:00:00"},{"$f":"Usage!$F110","v":0},{"$f":"Usage!$G110","v":0},{"$f":"Usage!$H110","v":0},{"$f":"Usage!$L110","v":0},{"$f":"Account!$AI$2","v":0},{"$f":"Usage!$N110","v":0},{"$f":"Usage!$M110","v":0},{"$f":"Account!$AH$2","v":0},{"$f":"Usage!$O110","v":0},0,{"$f":"Tenant!$H110","v":0},{"$f":"Account!$Y$2/100","v":0},{"$f":"Usage!$R110","v":0},{"$f":"Account!$X$2/100","v":0},{"$f":"Usage!$S110","v":0},{"$f":"Tenant!$I110","v":0},{"$f":"Usage!$V110","v":0},{"$f":"Account!$AB$2","v":0},{"$f":"Usage!$X110","v":0},{"$f":"Usage!$W110","v":0},{"$f":"Account!$AA$2","v":0},{"$f":"Usage!$Y110","v":0},{"$f":"Usage!$Z110","v":0},0]
[{"$f":"Tenant!$A111","v":110},{"$f":"Account!$C$2","v":0},{"$f":"Account!$I$2","v":0},{"$f":"Tenant!$B111","v":0},{"$f":"Tenant!$C111","v":0},{"$f":"Tenant!$D111","v":0},{"$f":"Tenant!$E111","v":0},{"$f":"Tenant!$G111","v":0},{"$f":"Usage!$D111","v":"00:00:00"},{"$f":"Usage!$E111","v":"00:00:00"},{"$f":"Usage!$F111","v":0},{"$f":"Usage!$G111","v":0},{"$f":"Usage!$H111","v":0},{"$f":"Usage!$L111","v":0},{"$f":"Account!$AI$2","v":0},{"$f":"Usage!$N111","v":0},{"$f":"Usage!$M111","v":0},{"$f":"Account!$AH$2","v":0},{"$f":"Usage!$O111","v":0},0,{"$f":"Tenant!$H111","v":0},{"$f":"Account!$Y$2/100","v":0},{"$f":"Usage!$R111","v":0},{"$f":"Account!$X$2/100","v":0},{"$f":"Usage!$S111","v":0},{"$f":"Tenant!$I111","v":0},{"$f":"Usage!$V111","v":0},{"$f":"Account!$AB$2","v":0},{"$f":"Usage!$X111","v":0},{"$f":"Usage!$W111","v":0},{"$f":"Account!$AA$2","v":0},{"$f":"Usage!$Y111","v":0},{"$f":"Usage!$Z111","v":0},0]
[{"$f":"Tenant!$A112","v":111},{"$f":"Account!$C$2","v":0},{"$f":"Account!$I$2","v":0},{"$f":"Tenant!$B112","v":0},{"$f":"Tenant!$C112","v":0},{"$f":"Tenant!$D112","v":0},{"$f":"Tenant!$E112","v":0},{"$f":"Tenant!$G112","v":0},{"$f":"Usage!$D112","v":"00:00:00"},{"$f":"Usage!$E112","v":"00:00:00"},{"$f":"Usage!$F112","v":0},{"$f":"Usage!$G112","v":0},{"$f":"Usage!$H112","v":0},{"$f":"Usage!$L112","v":0},{"$f":"Account!$AI$2","v":0},{"$f":"Usage!$N112","v":0},{"$f":"Usage!$M112","v":0},{"$f":"Account!$AH$2","v":0},{"$f":"Usage!$O112","v":0},0,{"$f":"Tenant!$H112","v":0},{"$f":"Account!$Y$2/100","v":0},{"$f":"Usage!$R112","v":0},{"$f":"Account!$X$2/100","v":0},{"$f":"Usage!$S112","v":0},{"$f":"Tenant!$I112","v":0},{"$f":"Usage!$V112","v":0},{"$f":"Account!$AB$2","v":0},{"$f":"Usage!$X112","v":0},{"$f":"Usage!$W112","v":0},{"$f":"Account!$AA$2","v":0},{"$f":"Usage!$Y112","v":0},{"$f":"Usage!$Z112","v":0},0]
[{"$f":"Tenant!$A113","v":112},{"$f":"Account!$C$2","v":0},{"$f":"Account!$I$2","v":0},{"$f":"Tenant!$B113","v":0},{"$f":"Tenant!$C113","v":0},{"$f":"Tenant!$D113","v":0},{"$f":"Tenant!$E113","v":0},{"$f":"Tenant!$G113","v":0},{"$f":"Usage!$D113","v":"00:00:00"},{"$f":"Usage!$E113","v":"00:00:00"},{"$f":"Usage!$F113","v":0},{"$f":"Usage!$G113","v":0},{"$f":"Usage!$H113","v":0},{"$f":"Usage!$L113","v":0},{"$f":"Account!$AI$2","v":0},{"$f":"Usage!$N113","v":0},{"$f":"Usage!$M113","v":0},{"$f":"Account!$AH$2","v":0},{"$f":"Usage!$O113","v":0},0,{"$f":"Tenant!$H113","v":0},{"$f":"Account!$Y$2/100","v":0},{"$f":"Usage!$R113","v":0},{"$f":"Account!$X$2/100","v":0},{"$f":"Usage!$S113","v":0},{"$f":"Tenant!$I113","v":0},{"$f":"Usage!$V113","v":0},{"$f":"Account!$AB$2","v":0},{"$f":"Usage!$X113","v":0},{"$f":"Usage!$W113","v":0},{"$f":"Account!$AA$2","v":0},{"$f":"Usage!$Y113","v":0},{"$f":"Usage!$Z113","v":0},0]
[{"$f":"Tenant!$A114","v":113},{"$f":"Account!$C$2","v":0},{"$f":"Account!$I$2","v":0},{"$f":"Tenant!$B114","v":0},{"$f":"Tenant!$C114","v":0},{"$f":"Tenant!$D114","v":0},{"$f":"Tenant!$E114","v":0},{"$f":"Tenant!$G114","v":0},{"$f":"Usage!$D114","v":"00:00:00"},{"$f":"Usage!$E114","v":"00:00:00"},{"$f":"Usage!$F114","v":0},{"$f":"Usage!$G114","v":0},{"$f":"Usage!$H114","v":0},{"$f":"Usage!$L114","v":0},{"$f":"Account!$AI$2","v":0},{"$f":"Usage!$N114","v":0},{"$f":"Usage!$M114","v":0},{"$f":"Account!$AH$2","v":0},{"$f":"Usage!$O114","v":0},0,{"$f":"Tenant!$H114","v":0},{"$f":"Account!$Y$2/100","v":0},{"$f":"Usage!$R114","v":0},{"$f":"Account!$X$2/100","v":0},{"$f":"Usage!$S114","v":0},{"$f":"Tenant!$I114","v":0},{"$f":"Usage!$V114","v":0},{"$f":"Account!$AB$2","v":0},{"$f":"Usage!$X114","v":0},{"$f":"Usage!$W114","v":0},{"$f":"Account!$AA$2","v":0},{"$f":"Usage!$Y114","v":0},{"$f":"Usage!$Z114","v":0},0]
[{"$f":"Tenant!$A115","v":114},{"$f":"Account!$C$2","v":0},{"$f":"Account!$I$2","v":0},{"$f":"Tenant!$B115","v":0},{"$f":"Tenant!$C115","v":0},{"$f":"Tenant!$D115","v":0},{"$f":"Tenant!$E115","v":0},{"$f":"Tenant!$G115","v":0},{"$f":"Usage!$D115","v":"00:00:00"},{"$f":"Usage!$E115","v":"00:00:00"},{"$f":"Usage!$F115","v":0},{"$f":"Usage!$G115","v":0},{"$f":"Usage!$H115","v":0},{"$f":"Usage!$L115","v":0},{"$f":"Account!$AI$2","v":0},{"$f":"Usage!$N115","v":0},{"$f":"Usage!$M115","v":0},{"$f":"Account!$AH$2","v":0},{"$f":"Usage!$O115","v":0},0,{"$f":"Tenant!$H115","v":0},{"$f":"Account!$Y$2/100","v":0},{"$f":"Usage!$R115","v":0},{"$f":"Account!$X$2/100","v":0},{"$f":"Usage!$S115","v":0},{"$f":"Tenant!$I115","v":0},{"$f":"Usage!$V115","v":0},{"$f":"Account!$AB$2","v":0},{"$f":"Usage!$X115","v":0},{"$f":"Usage!$W115","v":0},{"$f":"Account!$AA$2","v":0},{"$f":"Usage!$Y115","v":0},{"$f":"Usage!$Z115","v":0},0]
[{"$f":"Tenant!$A116","v":115},{"$f":"Account!$C$2","v":0},{"$f":"Account!$I$2","v":0},{"$f":"Tenant!$B116","v":0},{"$f":"Tenant!$C116","v":0},{"$f":"Tenant!$D116","v":0},{"$f":"Tenant!$E116","v":0},{"$f":"Tenant!$G116","v":0},{"$f":"Usage!$D116","v":"00:00:00"},{"$f":"Usage!$E116","v":"00:00:00"},{"$f":"Usage!$F116","v":0},{"$f":"Usage!$G116","v":0},{"$f":"Usage!$H116","v":0},{"$f":"Usage!$L116","v":0},{"$f":"Account!$AI$2","v":0},{"$f":"Usage!$N116","v":0},{"$f":"Usage!$M116","v":0},{"$f":"Account!$AH$2","v":0},{"$f":"Usage!$O116","v":0},0,{"$f":"Tenant!$H116","v":0},{"$f":"Account!$Y$2/100","v":0},{"$f":"Usage!$R116","v":0},{"$f":"Account!$X$2/100","v":0},{"$f":"Usage!$S116","v":0},{"$f":"Tenant!$I116","v":0},{"$f":"Usage!$V116","v":0},{"$f":"Account!$AB$2","v":0},{"$f":"Usage!$X116","v":0},{"$f":"Usage!$W116","v":0},{"$f":"Account!$AA$2","v":0},{"$f":"Usage!$Y116","v":0},{"$f":"Usage!$Z116","v":0},0]
[{"$f":"Tenant!$A117","v":116},{"$f":"Account!$C$2","v":0},{"$f":"Account!$I$2","v":0},{"$f":"Tenant!$B117","v":0},{"$f":"Tenant!$C117","v":0},{"$f":"Tenant!$D117","v":0},{"$f":"Tenant!$E117","v":0},{"$f":"Tenant!$G117","v":0},{"$f":"Usage!$D117","v":"00:00:00"},{"$f":"Usage!$E117","v":"00:00:00"},{"$f":"Usage!$F117","v":0},{"$f":"Usage!$G117","v":0},{"$f":"Usage!$H117","v":0},{"$f":"Usage!$L117","v":0},{"$f":"Account!$AI$2","v":0},{"$f":"Usage!$N117","v":0},{"$f":"Usage!$M117","v":0},{"$f":"Account!$AH$2","v":0},{"$f":"Usage!$O117","v":0},0,{"$f":"Tenant!$H117","v":0},{"$f":"Account!$Y$2/100","v":0},{"$f":"Usage!$R117","v":0},{"$f":"Account!$X$2/100","v":0},{"$f":"Usage!$S117","v":0},{"$f":"Tenant!$I117","v":0},{"$f":"Usage!$V117","v":0},{"$f":"Account!$AB$2","v":0},{"$f":"Usage!$X117","v":0},{"$f":"Usage!$W117","v":0},{"$f":"Account!$AA$2","v":0},{"$f":"Usage!$Y117","v":0},{"$f":"Usage!$Z117","v":0},0]
[{"$f":"Tenant!$A118","v":117},{"$f":"Account!$C$2","v":0},{"$f":"Account!$I$2","v":0},{"$f":"Tenant!$B118","v":0},{"$f":"Tenant!$C118","v":0},{"$f":"Tenant!$D118","v":0},{"$f":"Tenant!$E118","v":0},{"$f":"Tenant!$G118","v":0},{"$f":"Usage!$D118","v":"00:00:00"},{"$f":"Usage!$E118","v":"00:00:00"},{"$f":"Usage!$F118","v":0},{"$f":"Usage!$G118","v":0},{"$f":"Usage!$H118","v":0},{"$f":"Usage!$L118","v":0},{"$f":"Account!$AI$2","v":0},{"$f":"Usage!$N118","v":0},{"$f":"Usage!$M118","v":0},{"$f":"Account!$AH$2","v":0},{"$f":"Usage!$O118","v":0},0,{"$f":"Tenant!$H118","v":0},{"$f":"Account!$Y$2/100","v":0},{"$f":"Usage!$R118","v":0},{"$f":"Account!$X$2/100","v":0},{"$f":"Usage!$S118","v":0},{"$f":"Tenant!$I118","v":0},{"$f":"Usage!$V118","v":0},{"$f":"Account!$AB$2","v":0},{"$f":"Usage!$X118","v":0},{"$f":"Usage!$W118","v":0},{"$f":"Account!$AA$2","v":0},{"$f":"Usage!$Y118","v":0},{"$f":"Usage!$Z118","v":0},0]
[{"$f":"Tenant!$A119","v":118},{"$f":"Account!$C$2","v":0},{"$f":"Account!$I$2","v":0},{"$f":"Tenant!$B119","v":0},{"$f":"Tenant!$C119","v":0},{"$f":"Tenant!$D119","v":0},{"$f":"Tenant!$E119","v":0},{"$f":"Tenant!$G119","v":0},{"$f":"Usage!$D119","v":"00:00:00"},{"$f":"Usage!$E119","v":"00:00:00"},{"$f":"Usage!$F119","v":0},{"$f":"Usage!$G119","v":0},{"$f":"Usage!$H119","v":0},{"$f":"Usage!$L119","v":0},{"$f":"Account!$AI$2","v":0},{"$f":"Usage!$N119","v":0},{"$f":"Usage!$M119","v":0},{"$f":"Account!$AH$2","v":0},{"$f":"Usage!$O119","v":0},0,{"$f":"Tenant!$H119","v":0},{"$f":"Account!$Y$2/100","v":0},{"$f":"Usage!$R119","v":0},{"$f":"Account!$X$2/100","v":0},{"$f":"Usage!$S119","v":0},{"$f":"Tenant!$I119","v":0},{"$f":"Usage!$V119","v":0},{"$f":"Account!$AB$2","v":0},{"$f":"Usage!$X119","v":0},{"$f":"Usage!$W119","v":0},{"$f":"Account!$AA$2","v":0},{"$f":"Usage!$Y119","v":0},{"$f":"Usage!$Z119","v":0},0]
[{"$f":"Tenant!$A120","v":119},{"$f":"Account!$C$2","v":0},{"$f":"Account!$I$2","v":0},{"$f":"Tenant!$B120","v":0},{"$f":"Tenant!$C120","v":0},{"$f":"Tenant!$D120","v":0},{"$f":"Tenant!$E120","v":0},{"$f":"Tenant!$G120","v":0},{"$f":"Usage!$D120","v":"00:00:00"},{"$f":"Usage!$E120","v":"00:00:00"},{"$f":"Usage!$F120","v":0},{"$f":"Usage!$G120","v":0},{"$f":"Usage!$H120","v":0},{"$f":"Usage!$L120","v":0},{"$f":"Account!$AI$2","v":0},{"$f":"Usage!$N120","v":0},{"$f":"Usage!$M120","v":0},{"$f":"Account!$AH$2","v":0},{"$f":"Usage!$O120","v":0},0,{"$f":"Tenant!$H120","v":0},{"$f":"Account!$Y$2/100","v":0},{"$f":"Usage!$R120","v":0},{"$f":"Account!$X$2/100","v":0},{"$f":"Usage!$S120","v":0},{"$f":"Tenant!$I120","v":0},{"$f":"Usage!$V120","v":0},{"$f":"Account!$AB$2","v":0},{"$f":"Usage!$X120","v":0},{"$f":"Usage!$W120","v":0},{"$f":"Account!$AA$2","v":0},{"$f":"Usage!$Y120","v":0},{"$f":"Usage!$Z120","v":0},0]
[{"$f":"Tenant!$A121","v":120},{"$f":"Account!$C$2","v":0},{"$f":"Account!$I$2","v":0},{"$f":"Tenant!$B121","v":0},{"$f":"Tenant!$C121","v":0},{"$f":"Tenant!$D121","v":0},{"$f":"Tenant!$E121","v":0},{"$f":"Tenant!$G121","v":0},{"$f":"Usage!$D121","v":"00:00:00"},{"$f":"Usage!$E121","v":"00:00:00"},{"$f":"Usage!$F121","v":0},{"$f":"Usage!$G121","v":0},{"$f":"Usage!$H121","v":0},{"$f":"Usage!$L121","v":0},{"$f":"Account!$AI$2","v":0},{"$f":"Usage!$N121","v":0},{"$f":"Usage!$M121","v":0},{"$f":"Account!$AH$2","v":0},{"$f":"Usage!$O121","v":0},0,{"$f":"Tenant!$H121","v":0},{"$f":"Account!$Y$2/100","v":0},{"$f":"Usage!$R121","v":0},{"$f":"Account!$X$2/100","v":0},{"$f":"Usage!$S121","v":0},{"$f":"Tenant!$I121","v":0},{"$f":"Usage!$V121","v":0},{"$f":"Account!$AB$2","v":0},{"$f":"Usage!$X121","v":0},{"$f":"Usage!$W121","v":0},{"$f":"Account!$AA$2","v":0},{"$f":"Usage!$Y121","v":0},{"$f":"Usage!$Z121","v":0},0]
[{"$f":"Tenant!$A122","v":121},{"$f":"Account!$C$2","v":0},{"$f":"Account!$I$2","v":0},{"$f":"Tenant!$B122","v":0},{"$f":"Tenant!$C122","v":0},{"$f":"Tenant!$D122","v":0},{"$f":"Tenant!$E122","v":0},{"$f":"Tenant!$G122","v":0},{"$f":"Usage!$D122","v":"00:00:00"},{"$f":"Usage!$E122","v":"00:00:00"},{"$f":"Usage!$F122","v":0},{"$f":"Usage!$G122","v":0},{"$f":"Usage!$H122","v":0},{"$f":"Usage!$L122","v":0},{"$f":"Account!$AI$2","v":0},{"$f":"Usage!$N122","v":0},{"$f":"Usage!$M122","v":0},{"$f":"Account!$AH$2","v":0},{"$f":"Usage!$O122","v":0},0,{"$f":"Tenant!$H122","v":0},{"$f":"Account!$Y$2/100","v":0},{"$f":"Usage!$R122","v":0},{"$f":"Account!$X$2/100","v":0},{"$f":"Usage!$S122","v":0},{"$f":"Tenant!$I122","v":0},{"$f":"Usage!$V122","v":0},{"$f":"Account!$AB$2","v":0},{"$f":"Usage!$X122","v":0},{"$f":"Usage!$W122","v":0},{"$f":"Account!$AA$2","v":0},{"$f":"Usage!$Y122","v":0},{"$f":"Usage!$Z122","v":0},0]
[{"$f":"Tenant!$A123","v":122},{"$f":"Account!$C$2","v":0},{"$f":"Account!$I$2","v":0},{"$f":"Tenant!$B123","v":0},{"$f":"Tenant!$C123","v":0},{"$f":"Tenant!$D123","v":0},{"$f":"Tenant!$E123","v":0},{"$f":"Tenant!$G123","v":0},{"$f":"Usage!$D123","v":"00:00:00"},{"$f":"Usage!$E123","v":"00:00:00"},{"$f":"Usage!$F123","v":0},{"$f":"Usage!$G123","v":0},{"$f":"Usage!$H123","v":0},{"$f":"Usage!$L123","v":0},{"$f":"Account!$AI$2","v":0},{"$f":"Usage!$N123","v":0},{"$f":"Usage!$M123","v":0},{"$f":"Account!$AH$2","v":0},{"$f":"Usage!$O123","v":0},0,{"$f":"Tenant!$H123","v":0},{"$f":"Account!$Y$2/100","v":0},{"$f":"Usage!$R123","v":0},{"$f":"Account!$X$2/100","v":0},{"$f":"Usage!$S123","v":0},{"$f":"Tenant!$I123","v":0},{"$f":"Usage!$V123","v":0},{"$f":"Account!$AB$2","v":0},{"$f":"Usage!$X123","v":0},{"$f":"Usage!$W123","v":0},{"$f":"Account!$AA$2","v":0},{"$f":"Usage!$Y123","v":0},{"$f":"Usage!$Z123","v":0},0]
[{"$f":"Tenant!$A124","v":123},{"$f":"Account!$C$2","v":0},{"$f":"Account!$I$2","v":0},{"$f":"Tenant!$B124","v":0},{"$f":"Tenant!$C124","v":0},{"$f":"Tenant!$D124","v":0},{"$f":"Tenant!$E124","v":0},{"$f":"Tenant!$G124","v":0},{"$f":"Usage!$D124","v":"00:00:00"},{"$f":"Usage!$E124","v":"00:00:00"},{"$f":"Usage!$F124","v":0},{"$f":"Usage!$G124","v":0},{"$f":"Usage!$H124","v":0},{"$f":"Usage!$L124","v":0},{"$f":"Account!$AI$2","v":0},{"$f":"Usage!$N124","v":0},{"$f":"Usage!$M124","v":0},{"$f":"Account!$AH$2","v":0},{"$f":"Usage!$O124","v":0},0,{"$f":"Tenant!$H124","v":0},{"$f":"Account!$Y$2/100","v":0},{"$f":"Usage!$R124","v":0},{"$f":"Account!$X$2/100","v":0},{"$f":"Usage!$S124","v":0},{"$f":"Tenant!$I124","v":0},{"$f":"Usage!$V124","v":0},{"$f":"Account!$AB$2","v":0},{"$f":"Usage!$X124","v":0},{"$f":"Usage!$W124","v":0},{"$f":"Account!$AA$2","v":0},{"$f":"Usage!$Y124","v":0},{"$f":"Usage!$Z124","v":0},0]
[{"$f":"Tenant!$A125","v":124},{"$f":"Account!$C$2","v":0},{"$f":"Account!$I$2","v":0},{"$f":"Tenant!$B125","v":0},{"$f":"Tenant!$C125","v":0},{"$f":"Tenant!$D125","v":0},{"$f":"Tenant!$E125","v":0},{"$f":"Tenant!$G125","v":0},{"$f":"Usage!$D125","v":"00:00:00"},{"$f":"Usage!$E125","v":"00:00:00"},{"$f":"Usage!$F125","v":0},{"$f":"Usage!$G125","v":0},{"$f":"Usage!$H125","v":0},{"$f":"Usage!$L125","v":0},{"$f":"Account!$AI$2","v":0},{"$f":"Usage!$N125","v":0},{"$f":"Usage!$M125","v":0},{"$f":"Account!$AH$2","v":0},{"$f":"Usage!$O125","v":0},0,{"$f":"Tenant!$H125","v":0},{"$f":"Account!$Y$2/100","v":0},{"$f":"Usage!$R125","v":0},{"$f":"Account!$X$2/100","v":0},{"$f":"Usage!$S125","v":0},{"$f":"Tenant!$I125","v":0},{"$f":"Usage!$V125","v":0},{"$f":"Account!$AB$2","v":0},{"$f":"Usage!$X125","v":0},{"$f":"Usage!$W125","v":0},{"$f":"Account!$AA$2","v":0},{"$f":"Usage!$Y125","v":0},{"$f":"Usage!$Z125","v":0},0]
[{"$f":"Tenant!$A126","v":125},{"$f":"Account!$C$2","v":0},{"$f":"Account!$I$2","v":0},{"$f":"Tenant!$B126","v":0},{"$f":"Tenant!$C126","v":0},{"$f":"Tenant!$D126","v":0},{"$f":"Tenant!$E126","v":0},{"$f":"Tenant!$G126","v":0},{"$f":"Usage!$D126","v":"00:00:00"},{"$f":"Usage!$E126","v":"00:00:00"},{"$f":"Usage!$F126","v":0},{"$f":"Usage!$G126","v":0},{"$f":"Usage!$H126","v":0},{"$f":"Usage!$L126","v":0},{"$f":"Account!$AI$2","v":0},{"$f":"Usage!$N126","v":0},{"$f":"Usage!$M126","v":0},{"$f":"Account!$AH$2","v":0},{"$f":"Usage!$O126","v":0},0,{"$f":"Tenant!$H126","v":0},{"$f":"Account!$Y$2/100","v":0},{"$f":"Usage!$R126","v":0},{"$f":"Account!$X$2/100","v":0},{"$f":"Usage!$S126","v":0},{"$f":"Tenant!$I126","v":0},{"$f":"Usage!$V126","v":0},{"$f":"Account!$AB$2","v":0},{"$f":"Usage!$X126","v":0},{"$f":"Usage!$W126","v":0},{"$f":"Account!$AA$2","v":0},{"$f":"Usage!$Y126","v":0},{"$f":"Usage!$Z126","v":0},0]
[{"$f":"Tenant!$A127","v":126},{"$f":"Account!$C$2","v":0},{"$f":"Account!$I$2","v":0},{"$f":"Tenant!$B127","v":0},{"$f":"Tenant!$C127","v":0},{"$f":"Tenant!$D127","v":0},{"$f":"Tenant!$E127","v":0},{"$f":"Tenant!$G127","v":0},{"$f":"Usage!$D127","v":"00:00:00"},{"$f":"Usage!$E127","v":"00:00:00"},{"$f":"Usage!$F127","v":0},{"$f":"Usage!$G127","v":0},{"$f":"Usage!$H127","v":0},{"$f":"Usage!$L127","v":0},{"$f":"Account!$AI$2","v":0},{"$f":"Usage!$N127","v":0},{"$f":"Usage!$M127","v":0},{"$f":"Account!$AH$2","v":0},{"$f":"Usage!$O127","v":0},0,{"$f":"Tenant!$H127","v":0},{"$f":"Account!$Y$2/100","v":0},{"$f":"Usage!$R127","v":0},{"$f":"Account!$X$2/100","v":0},{"$f":"Usage!$S127","v":0},{"$f":"Tenant!$I127","v":0},{"$f":"Usage!$V127","v":0},{"$f":"Account!$AB$2","v":0},{"$f":"Usage!$X127","v":0},{"$f":"Usage!$W127","v":0},{"$f":"Account!$AA$2","v":0},{"$f":"Usage!$Y127","v":0},{"$f":"Usage!$Z127","v":0},0]
[{"$f":"Tenant!$A128","v":127},{"$f":"Account!$C$2","v":0},{"$f":"Account!$I$2","v":0},{"$f":"Tenant!$B128","v":0},{"$f":"Tenant!$C128","v":0},{"$f":"Tenant!$D128","v":0},{"$f":"Tenant!$E128","v":0},{"$f":"Tenant!$G128","v":0},{"$f":"Usage!$D128","v":"00:00:00"},{"$f":"Usage!$E128","v":"00:00:00"},{"$f":"Usage!$F128","v":0},{"$f":"Usage!$G128","v":0},{"$f":"Usage!$H128","v":0},{"$f":"Usage!$L128","v":0},{"$f":"Account!$AI$2","v":0},{"$f":"Usage!$N128","v":0},{"$f":"Usage!$M128","v":0},{"$f":"Account!$AH$2","v":0},{"$f":"Usage!$O128","v":0},0,{"$f":"Tenant!$H128","v":0},{"$f":"Account!$Y$2/100","v":0},{"$f":"Usage!$R128","v":0},{"$f":"Account!$X$2/100","v":0},{"$f":"Usage!$S128","v":0},{"$f":"Tenant!$I128","v":0},{"$f":"Usage!$V128","v":0},{"$f":"Account!$AB$2","v":0},{"$f":"Usage!$X128","v":0},{"$f":"Usage!$W128","v":0},{"$f":"Account!$AA$2","v":0},{"$f":"Usage!$Y128","v":0},{"$f":"Usage!$Z128","v":0},0]
[{"$f":"Tenant!$A129","v":128},{"$f":"Account!$C$2","v":0},{"$f":"Account!$I$2","v":0},{"$f":"Tenant!$B129","v":0},{"$f":"Tenant!$C129","v":0},{"$f":"Tenant!$D129","v":0},{"$f":"Tenant!$E129","v":0},{"$f":"Tenant!$G129","v":0},{"$f":"Usage!$D129","v":"00:00:00"},{"$f":"Usage!$E129","v":"00:00:00"},{"$f":"Usage!$F129","v":0},{"$f":"Usage!$G129","v":0},{"$f":"Usage!$H129","v":0},{"$f":"Usage!$L129","v":0},{"$f":"Account!$AI$2","v":0},{"$f":"Usage!$N129","v":0},{"$f":"Usage!$M129","v":0},{"$f":"Account!$AH$2","v":0},{"$f":"Usage!$O129","v":0},0,{"$f":"Tenant!$H129","v":0},{"$f":"Account!$Y$2/100","v":0},{"$f":"Usage!$R129","v":0},{"$f":"Account!$X$2/100","v":0},{"$f":"Usage!$S129","v":0},{"$f":"Tenant!$I129","v":0},{"$f":"Usage!$V129","v":0},{"$f":"Account!$AB$2","v":0},{"$f":"Usage!$X129","v":0},{"$f":"Usage!$W129","v":0},{"$f":"Account!$AA$2","v":0},{"$f":"Usage!$Y129","v":0},{"$f":"Usage!$Z129","v":0},0]
[{"$f":"Tenant!$A130","v":129},{"$f":"Account!$C$2","v":0},{"$f":"Account!$I$2","v":0},{"$f":"Tenant!$B130","v":0},{"$f":"Tenant!$C130","v":0},{"$f":"Tenant!$D130","v":0},{"$f":"Tenant!$E130","v":0},{"$f":"Tenant!$G130","v":0},{"$f":"Usage!$D130","v":"00:00:00"},{"$f":"Usage!$E130","v":"00:00:00"},{"$f":"Usage!$F130","v":0},{"$f":"Usage!$G130","v":0},{"$f":"Usage!$H130","v":0},{"$f":"Usage!$L130","v":0},{"$f":"Account!$AI$2","v":0},{"$f":"Usage!$N130","v":0},{"$f":"Usage!$M130","v":0},{"$f":"Account!$AH$2","v":0},{"$f":"Usage!$O130","v":0},0,{"$f":"Tenant!$H130","v":0},{"$f":"Account!$Y$2/100","v":0},{"$f":"Usage!$R130","v":0},{"$f":"Account!$X$2/100","v":0},{"$f":"Usage!$S130","v":0},{"$f":"Tenant!$I130","v":0},{"$f":"Usage!$V130","v":0},{"$f":"Account!$AB$2","v":0},{"$f":"Usage!$X130","v":0},{"$f":"Usage!$W130","v":0},{"$f":"Account!$AA$2","v":0},{"$f":"Usage!$Y130","v":0},{"$f":"Usage!$Z130","v":0},0]
[{"$f":"Tenant!$A131","v":130},{"$f":"Account!$C$2","v":0},{"$f":"Account!$I$2","v":0},{"$f":"Tenant!$B131","v":0},{"$f":"Tenant!$C131","v":0},{"$f":"Tenant!$D131","v":0},{"$f":"Tenant!$E131","v":0},{"$f":"Tenant!$G131","v":0},{"$f":"Usage!$D131","v":"00:00:00"},{"$f":"Usage!$E131","v":"00:00:00"},{"$f":"Usage!$F131","v":0},{"$f":"Usage!$G131","v":0},{"$f":"Usage!$H131","v":0},{"$f":"Usage!$L131","v":0},{"$f":"Account!$AI$2","v":0},{"$f":"Usage!$N131","v":0},{"$f":"Usage!$M131","v":0},{"$f":"Account!$AH$2","v":0},{"$f":"Usage!$O131","v":0},{"$f":"SUM($P131,$S131)","v":0},{"$f":"Tenant!$H131","v":0},{"$f":"Account!$Y$2/100","v":0},{"$f":"Usage!$R131","v":0},{"$f":"Account!$X$2/100","v":0},{"$f":"Usage!$S131","v":0},{"$f":"Tenant!$I131","v":0},{"$f":"Usage!$V131","v":0},{"$f":"Account!$AB$2","v":0},{"$f":"Usage!$X131","v":0},{"$f":"Usage!$W131","v":0},{"$f":"Account!$AA$2","v":0},{"$f":"Usage!$Y131","v":0},{"$f":"Usage!$Z131","v":0},{"$f":"$AG131","v":0}]
[{"$f":"Tenant!$A132","v":131},{"$f":"Account!$C$2","v":0},{"$f":"Account!$I$2","v":0},{"$f":"Tenant!$B132","v":0},{"$f":"Tenant!$C132","v":0},{"$f":"Tenant!$D132","v":0},{"$f":"Tenant!$E132","v":0},{"$f":"Tenant!$G132","v":0},{"$f":"Usage!$D132","v":"00:00:00"},{"$f":"Usage!$E132","v":"00:00:00"},{"$f":"Usage!$F132","v":0},{"$f":"Usage!$G132","v":0},{"$f":"Usage!$H132","v":0},{"$f":"Usage!$L132","v":0},{"$f":"Account!$AI$2","v":0},{"$f":"Usage!$N132","v":0},{"$f":"Usage!$M132","v":0},{"$f":"Account!$AH$2","v":0},{"$f":"Usage!$O132","v":0},0,{"$f":"Tenant!$H132","v":0},{"$f":"Account!$Y$2/100","v":0},{"$f":"Usage!$R132","v":0},{"$f":"Account!$X$2/100","v":0},{"$f":"Usage!$S132","v":0},{"$f":"Tenant!$I132","v":0},{"$f":"Usage!$V132","v":0},{"$f":"Account!$AB$2","v":0},{"$f":"Usage!$X132","v":0},{"$f":"Usage!$W132","v":0},{"$f":"Account!$AA$2","v":0},{"$f":"Usage!$Y132","v":0},{"$f":"Usage!$Z132","v":0},0]
[{"$f":"Tenant!$A133","v":132},{"$f":"Account!$C$2","v":0},{"$f":"Account!$I$2","v":0},{"$f":"Tenant!$B133","v":0},{"$f":"Tenant!$C133","v":0},{"$f":"Tenant!$D133","v":0},{"$f":"Tenant!$E133","v":0},{"$f":"Tenant!$G133","v":0},{"$f":"Usage!$D133","v":"00:00:00"},{"$f":"Usage!$E133","v":"00:00:00"},{"$f":"Usage!$F133","v":0},{"$f":"Usage!$G133","v":0},{"$f":"Usage!$H133","v":0},{"$f":"Usage!$L133","v":0},{"$f":"Account!$AI$2","v":0},{"$f":"Usage!$N133","v":0},{"$f":"Usage!$M133","v":0},{"$f":"Account!$AH$2","v":0},{"$f":"Usage!$O133","v":0},0,{"$f":"Tenant!$H133","v":0},{"$f":"Account!$Y$2/100","v":0},{"$f":"Usage!$R133","v":0},{"$f":"Account!$X$2/100","v":0},{"$f":"Usage!$S133","v":0},{"$f":"Tenant!$I133","v":0},{"$f":"Usage!$V133","v":0},{"$f":"Account!$AB$2","v":0},{"$f":"Usage!$X133","v":0},{"$f":"Usage!$W133","v":0},{"$f":"Account!$AA$2","v":0},{"$f":"Usage!$Y133","v":0},{"$f":"Usage!$Z133","v":0},0]
[{"$f":"Tenant!$A134","v":133},{"$f":"Account!$C$2","v":0},{"$f":"Account!$I$2","v":0},{"$f":"Tenant!$B134","v":0},{"$f":"Tenant!$C134","v":0},{"$f":"Tenant!$D134","v":0},{"$f":"Tenant!$E134","v":0},{"$f":"Tenant!$G134","v":0},{"$f":"Usage!$D134","v":"00:00:00"},{"$f":"Usage!$E134","v":"00:00:00"},{"$f":"Usage!$F134","v":0},{"$f":"Usage!$G134","v":0},{"$f":"Usage!$H134","v":0},{"$f":"Usage!$L134","v":0},{"$f":"Account!$AI$2","v":0},{"$f":"Usage!$N134","v":0},{"$f":"Usage!$M134","v":0},{"$f":"Account!$AH$2","v":0},{"$f":"Usage!$O134","v":0},0,{"$f":"Tenant!$H134","v":0},{"$f":"Account!$Y$2/100","v":0},{"$f":"Usage!$R134","v":0},{"$f":"Account!$X$2/100","v":0},{"$f":"Usage!$S134","v":0},{"$f":"Tenant!$I134","v":0},{"$f":"Usage!$V134","v":0},{"$f":"Account!$AB$2","v":0},{"$f":"Usage!$X134","v":0},{"$f":"Usage!$W134","v":0},{"$f":"Account!$AA$2","v":0},{"$f":"Usage!$Y134","v":0},{"$f":"Usage!$Z134","v":0},0]
[{"$f":"Tenant!$A135","v":134},{"$f":"Account!$C$2","v":0},{"$f":"Account!$I$2","v":0},{"$f":"Tenant!$B135","v":0},{"$f":"Tenant!$C135","v":0},{"$f":"Tenant!$D135","v":0},{"$f":"Tenant!$E135","v":0},{"$f":"Tenant!$G135","v":0},{"$f":"Usage!$D135","v":"00:00:00"},{"$f":"Usage!$E135","v":"00:00:00"},{"$f":"Usage!$F135","v":0},{"$f":"Usage!$G135","v":0},{"$f":"Usage!$H135","v":0},{"$f":"Usage!$L135","v":0},{"$f":"Account!$AI$2","v":0},{"$f":"Usage!$N135","v":0},{"$f":"Usage!$M135","v":0},{"$f":"Account!$AH$2","v":0},{"$f":"Usage!$O135","v":0},0,{"$f":"Tenant!$H135","v":0},{"$f":"Account!$Y$2/100","v":0},{"$f":"Usage!$R135","v":0},{"$f":"Account!$X$2/100","v":0},{"$f":"Usage!$S135","v":0},{"$f":"Tenant!$I135","v":0},{"$f":"Usage!$V135","v":0},{"$f":"Account!$AB$2","v":0},{"$f":"Usage!$X135","v":0},{"$f":"Usage!$W135","v":0},{"$f":"Account!$AA$2","v":0},{"$f":"Usage!$Y135","v":0},{"$f":"Usage!$Z135","v":0},0]
[{"$f":"Tenant!$A136","v":135},{"$f":"Account!$C$2","v":0},{"$f":"Account!$I$2","v":0},{"$f":"Tenant!$B136","v":0},{"$f":"Tenant!$C136","v":0},{"$f":"Tenant!$D136","v":0},{"$f":"Tenant!$E136","v":0},{"$f":"Tenant!$G136","v":0},{"$f":"Usage!$D136","v":"00:00:00"},{"$f":"Usage!$E136","v":"00:00:00"},{"$f":"Usage!$F136","v":0},{"$f":"Usage!$G136","v":0},{"$f":"Usage!$H136","v":0},{"$f":"Usage!$L136","v":0},{"$f":"Account!$AI$2","v":0},{"$f":"Usage!$N136","v":0},{"$f":"Usage!$M136","v":0},{"$f":"Account!$AH$2","v":0},{"$f":"Usage!$O136","v":0},0,{"$f":"Tenant!$H136","v":0},{"$f":"Account!$Y$2/100","v":0},{"$f":"Usage!$R136","v":0},{"$f":"Account!$X$2/100","v":0},{"$f":"Usage!$S136","v":0},{"$f":"Tenant!$I136","v":0},{"$f":"Usage!$V136","v":0},{"$f":"Account!$AB$2","v":0},{"$f":"Usage!$X136","v":0},{"$f":"Usage!$W136","v":0},{"$f":"Account!$AA$2","v":0},{"$f":"Usage!$Y136","v":0},{"$f":"Usage!$Z136","v":0},0]
[{"$f":"Tenant!$A137","v":136},{"$f":"Account!$C$2","v":0},{"$f":"Account!$I$2","v":0},{"$f":"Tenant!$B137","v":0},{"$f":"Tenant!$C137","v":0},{"$f":"Tenant!$D137","v":0},{"$f":"Tenant!$E137","v":0},{"$f":"Tenant!$G137","v":0},{"$f":"Usage!$D137","v":"00:00:00"},{"$f":"Usage!$E137","v":"00:00:00"},{"$f":"Usage!$F137","v":0},{"$f":"Usage!$G137","v":0},{"$f":"Usage!$H137","v":0},{"$f":"Usage!$L137","v":0},{"$f":"Account!$AI$2","v":0},{"$f":"Usage!$N137","v":0},{"$f":"Usage!$M137","v":0},{"$f":"Account!$AH$2","v":0},{"$f":"Usage!$O137","v":0},0,{"$f":"Tenant!$H137","v":0},{"$f":"Account!$Y$2/100","v":0},{"$f":"Usage!$R137","v":0},{"$f":"Account!$X$2/100","v":0},{"$f":"Usage!$S137","v":0},{"$f":"Tenant!$I137","v":0},{"$f":"Usage!$V137","v":0},{"$f":"Account!$AB$2","v":0},{"$f":"Usage!$X137","v":0},{"$f":"Usage!$W137","v":0},{"$f":"Account!$AA$2","v":0},{"$f":"Usage!$Y137","v":0},{"$f":"Usage!$Z137","v":0},0]
[{"$f":"Tenant!$A138","v":137},{"$f":"Account!$C$2","v":0},{"$f":"Account!$I$2","v":0},{"$f":"Tenant!$B138","v":0},{"$f":"Tenant!$C138","v":0},{"$f":"Tenant!$D138","v":0},{"$f":"Tenant!$E138","v":0},{"$f":"Tenant!$G138","v":0},{"$f":"Usage!$D138","v":"00:00:00"},{"$f":"Usage!$E138","v":"00:00:00"},{"$f":"Usage!$F138","v":0},{"$f":"Usage!$G138","v":0},{"$f":"Usage!$H138","v":0},{"$f":"Usage!$L138","v":0},{"$f":"Account!$AI$2","v":0},{"$f":"Usage!$N138","v":0},{"$f":"Usage!$M138","v":0},{"$f":"Account!$AH$2","v":0},{"$f":"Usage!$O138","v":0},0,{"$f":"Tenant!$H138","v":0},{"$f":"Account!$Y$2/100","v":0},{"$f":"Usage!$R138","v":0},{"$f":"Account!$X$2/100","v":0},{"$f":"Usage!$S138","v":0},{"$f":"Tenant!$I138","v":0},{"$f":"Usage!$V138","v":0},{"$f":"Account!$AB$2","v":0},{"$f":"Usage!$X138","v":0},{"$f":"Usage!$W138","v":0},{"$f":"Account!$AA$2","v":0},{"$f":"Usage!$Y138","v":0},{"$f":"Usage!$Z138","v":0},0]
[{"$f":"Tenant!$A139","v":138},{"$f":"Account!$C$2","v":0},{"$f":"Account!$I$2","v":0},{"$f":"Tenant!$B139","v":0},{"$f":"Tenant!$C139","v":0},{"$f":"Tenant!$D139","v":0},{"$f":"Tenant!$E139","v":0},{"$f":"Tenant!$G139","v":0},{"$f":"Usage!$D139","v":"00:00:00"},{"$f":"Usage!$E139","v":"00:00:00"},{"$f":"Usage!$F139","v":0},{"$f":"Usage!$G139","v":0},{"$f":"Usage!$H139","v":0},{"$f":"Usage!$L139","v":0},{"$f":"Account!$AI$2","v":0},{"$f":"Usage!$N139","v":0},{"$f":"Usage!$M139","v":0},{"$f":"Account!$AH$2","v":0},{"$f":"Usage!$O139","v":0},0,{"$f":"Tenant!$H139","v":0},{"$f":"Account!$Y$2/100","v":0},{"$f":"Usage!$R139","v":0},{"$f":"Account!$X$2/100","v":0},{"$f":"Usage!$S139","v":0},{"$f":"Tenant!$I139","v":0},{"$f":"Usage!$V139","v":0},{"$f":"Account!$AB$2","v":0},{"$f":"Usage!$X139","v":0},{"$f":"Usage!$W139","v":0},{"$f":"Account!$AA$2","v":0},{"$f":"Usage!$Y139","v":0},{"$f":"Usage!$Z139","v":0},0]
[{"$f":"Tenant!$A140","v":139},{"$f":"Account!$C$2","v":0},{"$f":"Account!$I$2","v":0},{"$f":"Tenant!$B140","v":0},{"$f":"Tenant!$C140","v":0},{"$f":"Tenant!$D140","v":0},{"$f":"Tenant!$E140","v":0},{"$f":"Tenant!$G140","v":0},{"$f":"Usage!$D140","v":"00:00:00"},{"$f":"Usage!$E140","v":"00:00:00"},{"$f":"Usage!$F140","v":0},{"$f":"Usage!$G140","v":0},{"$f":"Usage!$H140","v":0},{"$f":"Usage!$L140","v":0},{"$f":"Account!$AI$2","v":0},{"$f":"Usage!$N140","v":0},{"$f":"Usage!$M140","v":0},{"$f":"Account!$AH$2","v":0},{"$f":"Usage!$O140","v":0},0,{"$f":"Tenant!$H140","v":0},{"$f":"Account!$Y$2/100","v":0},{"$f":"Usage!$R140","v":0},{"$f":"Account!$X$2/100","v":0},{"$f":"Usage!$S140","v":0},{"$f":"Tenant!$I140","v":0},{"$f":"Usage!$V140","v":0},{"$f":"Account!$AB$2","v":0},{"$f":"Usage!$X140","v":0},{"$f":"Usage!$W140","v":0},{"$f":"Account!$AA$2","v":0},{"$f":"Usage!$Y140","v":0},{"$f":"Usage!$Z140","v":0},0]
[{"$f":"Tenant!$A141","v":140},{"$f":"Account!$C$2","v":0},{"$f":"Account!$I$2","v":0},{"$f":"Tenant!$B141","v":0},{"$f":"Tenant!$C141","v":0},{"$f":"Tenant!$D141","v":0},{"$f":"Tenant!$E141","v":0},{"$f":"Tenant!$G141","v":0},{"$f":"Usage!$D141","v":"00:00:00"},{"$f":"Usage!$E141","v":"00:00:00"},{"$f":"Usage!$F141","v":0},{"$f":"Usage!$G141","v":0},{"$f":"Usage!$H141","v":0},{"$f":"Usage!$L141","v":0},{"$f":"Account!$AI$2","v":0},{"$f":"Usage!$N141","v":0},{"$f":"Usage!$M141","v":0},{"$f":"Account!$AH$2","v":0},{"$f":"Usage!$O141","v":0},0,{"$f":"Tenant!$H141","v":0},{"$f":"Account!$Y$2/100","v":0},{"$f":"Usage!$R141","v":0},{"$f":"Account!$X$2/100","v":0},{"$f":"Usage!$S141","v":0},{"$f":"Tenant!$I141","v":0},{"$f":"Usage!$V141","v":0},{"$f":"Account!$AB$2","v":0},{"$f":"Usage!$X141","v":0},{"$f":"Usage!$W141","v":0},{"$f":"Account!$AA$2","v":0},{"$f":"Usage!$Y141","v":0},{"$f":"Usage!$Z141","v":0},0]
[{"$f":"Tenant!$A142","v":141},{"$f":"Account!$C$2","v":0},{"$f":"Account!$I$2","v":0},{"$f":"Tenant!$B142","v":0},{"$f":"Tenant!$C142","v":0},{"$f":"Tenant!$D142","v":0},{"$f":"Tenant!$E142","v":0},{"$f":"Tenant!$G142","v":0},{"$f":"Usage!$D142","v":"00:00:00"},{"$f":"Usage!$E142","v":"00:00:00"},{"$f":"Usage!$F142","v":0},{"$f":"Usage!$G142","v":0},{"$f":"Usage!$H142","v":0},{"$f":"Usage!$L142","v":0},{"$f":"Account!$AI$2","v":0},{"$f":"Usage!$N142","v":0},{"$f":"Usage!$M142","v":0},{"$f":"Account!$AH$2","v":0},{"$f":"Usage!$O142","v":0},0,{"$f":"Tenant!$H142","v":0},{"$f":"Account!$Y$2/100","v":0},{"$f":"Usage!$R142","v":0},{"$f":"Account!$X$2/100","v":0},{"$f":"Usage!$S142","v":0},{"$f":"Tenant!$I142","v":0},{"$f":"Usage!$V142","v":0},{"$f":"Account!$AB$2","v":0},{"$f":"Usage!$X142","v":0},{"$f":"Usage!$W142","v":0},{"$f":"Account!$AA$2","v":0},{"$f":"Usage!$Y142","v":0},{"$f":"Usage!$Z142","v":0},0]
[{"$f":"Tenant!$A143","v":142},{"$f":"Account!$C$2","v":0},{"$f":"Account!$I$2","v":0},{"$f":"Tenant!$B143","v":0},{"$f":"Tenant!$C143","v":0},{"$f":"Tenant!$D143","v":0},{"$f":"Tenant!$E143","v":0},{"$f":"Tenant!$G143","v":0},{"$f":"Usage!$D143","v":"00:00:00"},{"$f":"Usage!$E143","v":"00:00:00"},{"$f":"Usage!$F143","v":0},{"$f":"Usage!$G143","v":0},{"$f":"Usage!$H143","v":0},{"$f":"Usage!$L143","v":0},{"$f":"Account!$AI$2","v":0},{"$f":"Usage!$N143","v":0},{"$f":"Usage!$M143","v":0},{"$f":"Account!$AH$2","v":0},{"$f":"Usage!$O143","v":0},0,{"$f":"Tenant!$H143","v":0},{"$f":"Account!$Y$2/100","v":0},{"$f":"Usage!$R143","v":0},{"$f":"Account!$X$2/100","v":0},{"$f":"Usage!$S143","v":0},{"$f":"Tenant!$I143","v":0},{"$f":"Usage!$V143","v":0},{"$f":"Account!$AB$2","v":0},{"$f":"Usage!$X143","v":0},{"$f":"Usage!$W143","v":0},{"$f":"Account!$AA$2","v":0},{"$f":"Usage!$Y143","v":0},{"$f":"Usage!$Z143","v":0},0]
[{"$f":"Tenant!$A144","v":143},{"$f":"Account!$C$2","v":0},{"$f":"Account!$I$2","v":0},{"$f":"Tenant!$B144","v":0},{"$f":"Tenant!$C144","v":0},{"$f":"Tenant!$D144","v":0},{"$f":"Tenant!$E144","v":0},{"$f":"Tenant!$G144","v":0},{"$f":"Usage!$D144","v":"00:00:00"},{"$f":"Usage!$E144","v":"00:00:00"},{"$f":"Usage!$F144","v":0},{"$f":"Usage!$G144","v":0},{"$f":"Usage!$H144","v":0},{"$f":"Usage!$L144","v":0},{"$f":"Account!$AI$2","v":0},{"$f":"Usage!$N144","v":0},{"$f":"Usage!$M144","v":0},{"$f":"Account!$AH$2","v":0},{"$f":"Usage!$O144","v":0},0,{"$f":"Tenant!$H144","v":0},{"$f":"Account!$Y$2/100","v":0},{"$f":"Usage!$R144","v":0},{"$f":"Account!$X$2/100","v":0},{"$f":"Usage!$S144","v":0},{"$f":"Tenant!$I144","v":0},{"$f":"Usage!$V144","v":0},{"$f":"Account!$AB$2","v":0},{"$f":"Usage!$X144","v":0},{"$f":"Usage!$W144","v":0},{"$f":"Account!$AA$2","v":0},{"$f":"Usage!$Y144","v":0},{"$f":"Usage!$Z144","v":0},0]
[{"$f":"Tenant!$A145","v":144},{"$f":"Account!$C$2","v":0},{"$f":"Account!$I$2","v":0},{"$f":"Tenant!$B145","v":0},{"$f":"Tenant!$C145","v":0},{"$f":"Tenant!$D145","v":0},{"$f":"Tenant!$E145","v":0},{"$f":"Tenant!$G145","v":0},{"$f":"Usage!$D145","v":"00:00:00"},{"$f":"Usage!$E145","v":"00:00:00"},{"$f":"Usage!$F145","v":0},{"$f":"Usage!$G145","v":0},{"$f":"Usage!$H145","v":0},{"$f":"Usage!$L145","v":0},{"$f":"Account!$AI$2","v":0},{"$f":"Usage!$N145","v":0},{"$f":"Usage!$M145","v":0},{"$f":"Account!$AH$2","v":0},{"$f":"Usage!$O145","v":0},0,{"$f":"Tenant!$H145","v":0},{"$f":"Account!$Y$2/100","v":0},{"$f":"Usage!$R145","v":0},{"$f":"Account!$X$2/100","v":0},{"$f":"Usage!$S145","v":0},{"$f":"Tenant!$I145","v":0},{"$f":"Usage!$V145","v":0},{"$f":"Account!$AB$2","v":0},{"$f":"Usage!$X145","v":0},{"$f":"Usage!$W145","v":0},{"$f":"Account!$AA$2","v":0},{"$f":"Usage!$Y145","v":0},{"$f":"Usage!$Z145","v":0},0]
[{"$f":"Tenant!$A146","v":145},{"$f":"Account!$C$2","v":0},{"$f":"Account!$I$2","v":0},{"$f":"Tenant!$B146","v":0},{"$f":"Tenant!$C146","v":0},{"$f":"Tenant!$D146","v":0},{"$f":"Tenant!$E146","v":0},{"$f":"Tenant!$G146","v":0},{"$f":"Usage!$D146","v":"00:00:00"},{"$f":"Usage!$E146","v":"00:00:00"},{"$f":"Usage!$F146","v":0},{"$f":"Usage!$G146","v":0},{"$f":"Usage!$H146","v":0},{"$f":"Usage!$L146","v":0},{"$f":"Account!$AI$2","v":0},{"$f":"Usage!$N146","v":0},{"$f":"Usage!$M146","v":0},{"$f":"Account!$AH$2","v":0},{"$f":"Usage!$O146","v":0},0,{"$f":"Tenant!$H146","v":0},{"$f":"Account!$Y$2/100","v":0},{"$f":"Usage!$R146","v":0},{"$f":"Account!$X$2/100","v":0},{"$f":"Usage!$S146","v":0},{"$f":"Tenant!$I146","v":0},{"$f":"Usage!$V146","v":0},{"$f":"Account!$AB$2","v":0},{"$f":"Usage!$X146","v":0},{"$f":"Usage!$W146","v":0},{"$f":"Account!$AA$2","v":0},{"$f":"Usage!$Y146","v":0},{"$f":"Usage!$Z146","v":0},0]
[{"$f":"Tenant!$A147","v":146},{"$f":"Account!$C$2","v":0},{"$f":"Account!$I$2","v":0},{"$f":"Tenant!$B147","v":0},{"$f":"Tenant!$C147","v":0},{"$f":"Tenant!$D147","v":0},{"$f":"Tenant!$E147","v":0},{"$f":"Tenant!$G147","v":0},{"$f":"Usage!$D147","v":"00:00:00"},{"$f":"Usage!$E147","v":"00:00:00"},{"$f":"Usage!$F147","v":0},{"$f":"Usage!$G147","v":0},{"$f":"Usage!$H147","v":0},{"$f":"Usage!$L147","v":0},{"$f":"Account!$AI$2","v":0},{"$f":"Usage!$N147","v":0},{"$f":"Usage!$M147","v":0},{"$f":"Account!$AH$2","v":0},{"$f":"Usage!$O147","v":0},0,{"$f":"Tenant!$H147","v":0},{"$f":"Account!$Y$2/100","v":0},{"$f":"Usage!$R147","v":0},{"$f":"Account!$X$2/100","v":0},{"$f":"Usage!$S147","v":0},{"$f":"Tenant!$I147","v":0},{"$f":"Usage!$V147","v":0},{"$f":"Account!$AB$2","v":0},{"$f":"Usage!$X147","v":0},{"$f":"Usage!$W147","v":0},{"$f":"Account!$AA$2","v":0},{"$f":"Usage!$Y147","v":0},{"$f":"Usage!$Z147","v":0},0]
[{"$f":"Tenant!$A148","v":147},{"$f":"Account!$C$2","v":0},{"$f":"Account!$I$2","v":0},{"$f":"Tenant!$B148","v":0},{"$f":"Tenant!$C148","v":0},{"$f":"Tenant!$D148","v":0},{"$f":"Tenant!$E148","v":0},{"$f":"Tenant!$G148","v":0},{"$f":"Usage!$D148","v":"00:00:00"},{"$f":"Usage!$E148","v":"00:00:00"},{"$f":"Usage!$F148","v":0},{"$f":"Usage!$G148","v":0},{"$f":"Usage!$H148","v":0},{"$f":"Usage!$L148","v":0},{"$f":"Account!$AI$2","v":0},{"$f":"Usage!$N148","v":0},{"$f":"Usage!$M148","v":0},{"$f":"Account!$AH$2","v":0},{"$f":"Usage!$O148","v":0},0,{"$f":"Tenant!$H148","v":0},{"$f":"Account!$Y$2/100","v":0},{"$f":"Usage!$R148","v":0},{"$f":"Account!$X$2/100","v":0},{"$f":"Usage!$S148","v":0},{"$f":"Tenant!$I148","v":0},{"$f":"Usage!$V148","v":0},{"$f":"Account!$AB$2","v":0},{"$f":"Usage!$X148","v":0},{"$f":"Usage!$W148","v":0},{"$f":"Account!$AA$2","v":0},{"$f":"Usage!$Y148","v":0},{"$f":"Usage!$Z148","v":0},0]
[{"$f":"Tenant!$A149","v":148},{"$f":"Account!$C$2","v":0},{"$f":"Account!$I$2","v":0},{"$f":"Tenant!$B149","v":0},{"$f":"Tenant!$C149","v":0},{"$f":"Tenant!$D149","v":0},{"$f":"Tenant!$E149","v":0},{"$f":"Tenant!$G149","v":0},{"$f":"Usage!$D149","v":"00:00:00"},{"$f":"Usage!$E149","v":"00:00:00"},{"$f":"Usage!$F149","v":0},{"$f":"Usage!$G149","v":0},{"$f":"Usage!$H149","v":0},{"$f":"Usage!$L149","v":0},{"$f":"Account!$AI$2","v":0},{"$f":"Usage!$N149","v":0},{"$f":"Usage!$M149","v":0},{"$f":"Account!$AH$2","v":0},{"$f":"Usage!$O149","v":0},0,{"$f":"Tenant!$H149","v":0},{"$f":"Account!$Y$2/100","v":0},{"$f":"Usage!$R149","v":0},{"$f":"Account!$X$2/100","v":0},{"$f":"Usage!$S149","v":0},{"$f":"Tenant!$I149","v":0},{"$f":"Usage!$V149","v":0},{"$f":"Account!$AB$2","v":0},{"$f":"Usage!$X149","v":0},{"$f":"Usage!$W149","v":0},{"$f":"Account!$AA$2","v":0},{"$f":"Usage!$Y149","v":0},{"$f":"Usage!$Z149","v":0},0]
[{"$f":"Tenant!$A150","v":149},{"$f":"Account!$C$2","v":0},{"$f":"Account!$I$2","v":0},{"$f":"Tenant!$B150","v":0},{"$f":"Tenant!$C150","v":0},{"$f":"Tenant!$D150","v":0},{"$f":"Tenant!$E150","v":0},{"$f":"Tenant!$G150","v":0},{"$f":"Usage!$D150","v":"00:00:00"},{"$f":"Usage!$E150","v":"00:00:00"},{"$f":"Usage!$F150","v":0},{"$f":"Usage!$G150","v":0},{"$f":"Usage!$H150","v":0},{"$f":"Usage!$L150","v":0},{"$f":"Account!$AI$2","v":0},{"$f":"Usage!$N150","v":0},{"$f":"Usage!$M150","v":0},{"$f":"Account!$AH$2","v":0},{"$f":"Usage!$O150","v":0},0,{"$f":"Tenant!$H150","v":0},{"$f":"Account!$Y$2/100","v":0},{"$f":"Usage!$R150","v":0},{"$f":"Account!$X$2/100","v":0},{"$f":"Usage!$S150","v":0},{"$f":"Tenant!$I150","v":0},{"$f":"Usage!$V150","v":0},{"$f":"Account!$AB$2","v":0},{"$f":"Usage!$X150","v":0},{"$f":"Usage!$W150","v":0},{"$f":"Account!$AA$2","v":0},{"$f":"Usage!$Y150","v":0},{"$f":"Usage!$Z150","v":0},0]
[{"$f":"Tenant!$A151","v":150},{"$f":"Account!$C$2","v":0},{"$f":"Account!$I$2","v":0},{"$f":"Tenant!$B151","v":0},{"$f":"Tenant!$C151","v":0},{"$f":"Tenant!$D151","v":0},{"$f":"Tenant!$E151","v":0},{"$f":"Tenant!$G151","v":0},{"$f":"Usage!$D151","v":"00:00:00"},{"$f":"Usage!$E151","v":"00:00:00"},{"$f":"Usage!$F151","v":0},{"$f":"Usage!$G151","v":0},{"$f":"Usage!$H151","v":0},{"$f":"Usage!$L151","v":0},{"$f":"Account!$AI$2","v":0},{"$f":"Usage!$N151","v":0},{"$f":"Usage!$M151","v":0},{"$f":"Account!$AH$2","v":0},{"$f":"Usage!$O151","v":0},0,{"$f":"Tenant!$H151","v":0},{"$f":"Account!$Y$2/100","v":0},{"$f":"Usage!$R151","v":0},{"$f":"Account!$X$2/100","v":0},{"$f":"Usage!$S151","v":0},{"$f":"Tenant!$I151","v":0},{"$f":"Usage!$V151","v":0},{"$f":"Account!$AB$2","v":0},{"$f":"Usage!$X151","v":0},{"$f":"Usage!$W151","v":0},{"$f":"Account!$AA$2","v":0},{"$f":"Usage!$Y151","v":0},{"$f":"Usage!$Z151","v":0},0]
[{"$f":"Tenant!$A152","v":151},{"$f":"Account!$C$2","v":0},{"$f":"Account!$I$2","v":0},{"$f":"Tenant!$B152","v":0},{"$f":"Tenant!$C152","v":0},{"$f":"Tenant!$D152","v":0},{"$f":"Tenant!$E152","v":0},{"$f":"Tenant!$G152","v":0},{"$f":"Usage!$D152","v":"00:00:00"},{"$f":"Usage!$E152","v":"00:00:00"},{"$f":"Usage!$F152","v":0},{"$f":"Usage!$G152","v":0},{"$f":"Usage!$H152","v":0},{"$f":"Usage!$L152","v":0},{"$f":"Account!$AI$2","v":0},{"$f":"Usage!$N152","v":0},{"$f":"Usage!$M152","v":0},{"$f":"Account!$AH$2","v":0},{"$f":"Usage!$O152","v":0},0,{"$f":"Tenant!$H152","v":0},{"$f":"Account!$Y$2/100","v":0},{"$f":"Usage!$R152","v":0},{"$f":"Account!$X$2/100","v":0},{"$f":"Usage!$S152","v":0},{"$f":"Tenant!$I152","v":0},{"$f":"Usage!$V152","v":0},{"$f":"Account!$AB$2","v":0},{"$f":"Usage!$X152","v":0},{"$f":"Usage!$W152","v":0},{"$f":"Account!$AA$2","v":0},{"$f":"Usage!$Y152","v":0},{"$f":"Usage!$Z152","v":0},0]
[{"$f":"Tenant!$A153","v":152},{"$f":"Account!$C$2","v":0},{"$f":"Account!$I$2","v":0},{"$f":"Tenant!$B153","v":0},{"$f":"Tenant!$C153","v":0},{"$f":"Tenant!$D153","v":0},{"$f":"Tenant!$E153","v":0},{"$f":"Tenant!$G153","v":0},{"$f":"Usage!$D153","v":"00:00:00"},{"$f":"Usage!$E153","v":"00:00:00"},{"$f":"Usage!$F153","v":0},{"$f":"Usage!$G153","v":0},{"$f":"Usage!$H153","v":0},{"$f":"Usage!$L153","v":0},{"$f":"Account!$AI$2","v":0},{"$f":"Usage!$N153","v":0},{"$f":"Usage!$M153","v":0},{"$f":"Account!$AH$2","v":0},{"$f":"Usage!$O153","v":0},0,{"$f":"Tenant!$H153","v":0},{"$f":"Account!$Y$2/100","v":0},{"$f":"Usage!$R153","v":0},{"$f":"Account!$X$2/100","v":0},{"$f":"Usage!$S153","v":0},{"$f":"Tenant!$I153","v":0},{"$f":"Usage!$V153","v":0},{"$f":"Account!$AB$2","v":0},{"$f":"Usage!$X153","v":0},{"$f":"Usage!$W153","v":0},{"$f":"Account!$AA$2","v":0},{"$f":"Usage!$Y153","v":0},{"$f":"Usage!$Z153","v":0},0]
[{"$f":"Tenant!$A154","v":153},{"$f":"Account!$C$2","v":0},{"$f":"Account!$I$2","v":0},{"$f":"Tenant!$B154","v":0},{"$f":"Tenant!$C154","v":0},{"$f":"Tenant!$D154","v":0},{"$f":"Tenant!$E154","v":0},{"$f":"Tenant!$G154","v":0},{"$f":"Usage!$D154","v":"00:00:00"},{"$f":"Usage!$E154","v":"00:00:00"},{"$f":"Usage!$F154","v":0},{"$f":"Usage!$G154","v":0},{"$f":"Usage!$H154","v":0},{"$f":"Usage!$L154","v":0},{"$f":"Account!$AI$2","v":0},{"$f":"Usage!$N154","v":0},{"$f":"Usage!$M154","v":0},{"$f":"Account!$AH$2","v":0},{"$f":"Usage!$O154","v":0},0,{"$f":"Tenant!$H154","v":0},{"$f":"Account!$Y$2/100","v":0},{"$f":"Usage!$R154","v":0},{"$f":"Account!$X$2/100","v":0},{"$f":"Usage!$S154","v":0},{"$f":"Tenant!$I154","v":0},{"$f":"Usage!$V154","v":0},{"$f":"Account!$AB$2","v":0},{"$f":"Usage!$X154","v":0},{"$f":"Usage!$W154","v":0},{"$f":"Account!$AA$2","v":0},{"$f":"Usage!$Y154","v":0},{"$f":"Usage!$Z154","v":0},0]
[{"$f":"Tenant!$A155","v":154},{"$f":"Account!$C$2","v":0},{"$f":"Account!$I$2","v":0},{"$f":"Tenant!$B155","v":0},{"$f":"Tenant!$C155","v":0},{"$f":"Tenant!$D155","v":0},{"$f":"Tenant!$E155","v":0},{"$f":"Tenant!$G155","v":0},{"$f":"Usage!$D155","v":"00:00:00"},{"$f":"Usage!$E155","v":"00:00:00"},{"$f":"Usage!$F155","v":0},{"$f":"Usage!$G155","v":0},{"$f":"Usage!$H155","v":0},{"$f":"Usage!$L155","v":0},{"$f":"Account!$AI$2","v":0},{"$f":"Usage!$N155","v":0},{"$f":"Usage!$M155","v":0},{"$f":"Account!$AH$2","v":0},{"$f":"Usage!$O155","v":0},0,{"$f":"Tenant!$H155","v":0},{"$f":"Account!$Y$2/100","v":0},{"$f":"Usage!$R155","v":0},{"$f":"Account!$X$2/100","v":0},{"$f":"Usage!$S155","v":0},{"$f":"Tenant!$I155","v":0},{"$f":"Usage!$V155","v":0},{"$f":"Account!$AB$2","v":0},{"$f":"Usage!$X155","v":0},{"$f":"Usage!$W155","v":0},{"$f":"Account!$AA$2","v":0},{"$f":"Usage!$Y155","v":0},{"$f":"Usage!$Z155","v":0},0]
[{"$f":"Tenant!$A156","v":155},{"$f":"Account!$C$2","v":0},{"$f":"Account!$I$2","v":0},{"$f":"Tenant!$B156","v":0},{"$f":"Tenant!$C156","v":0},{"$f":"Tenant!$D156","v":0},{"$f":"Tenant!$E156","v":0},{"$f":"Tenant!$G156","v":0},{"$f":"Usage!$D156","v":"00:00:00"},{"$f":"Usage!$E156","v":"00:00:00"},{"$f":"Usage!$F156","v":0},{"$f":"Usage!$G156","v":0},{"$f":"Usage!$H156","v":0},{"$f":"Usage!$L156","v":0},{"$f":"Account!$AI$2","v":0},{"$f":"Usage!$N156","v":0},{"$f":"Usage!$M156","v":0},{"$f":"Account!$AH$2","v":0},{"$f":"Usage!$O156","v":0},0,{"$f":"Tenant!$H156","v":0},{"$f":"Account!$Y$2/100","v":0},{"$f":"Usage!$R156","v":0},{"$f":"Account!$X$2/100","v":0},{"$f":"Usage!$S156","v":0},{"$f":"Tenant!$I156","v":0},{"$f":"Usage!$V156","v":0},{"$f":"Account!$AB$2","v":0},{"$f":"Usage!$X156","v":0},{"$f":"Usage!$W156","v":0},{"$f":"Account!$AA$2","v":0},{"$f":"Usage!$Y156","v":0},{"$f":"Usage!$Z156","v":0},0]
[{"$f":"Tenant!$A157","v":156},{"$f":"Account!$C$2","v":0},{"$f":"Account!$I$2","v":0},{"$f":"Tenant!$B157","v":0},{"$f":"Tenant!$C157","v":0},{"$f":"Tenant!$D157","v":0},{"$f":"Tenant!$E157","v":0},{"$f":"Tenant!$G157","v":0},{"$f":"Usage!$D157","v":"00:00:00"},{"$f":"Usage!$E157","v":"00:00:00"},{"$f":"Usage!$F157","v":0},{"$f":"Usage!$G157","v":0},{"$f":"Usage!$H157","v":0},{"$f":"Usage!$L157","v":0},{"$f":"Account!$AI$2","v":0},{"$f":"Usage!$N157","v":0},{"$f":"Usage!$M157","v":0},{"$f":"Account!$AH$2","v":0},{"$f":"Usage!$O157","v":0},0,{"$f":"Tenant!$H157","v":0},{"$f":"Account!$Y$2/100","v":0},{"$f":"Usage!$R157","v":0},{"$f":"Account!$X$2/100","v":0},{"$f":"Usage!$S157","v":0},{"$f":"Tenant!$I157","v":0},{"$f":"Usage!$V157","v":0},{"$f":"Account!$AB$2","v":0},{"$f":"Usage!$X157","v":0},{"$f":"Usage!$W157","v":0},{"$f":"Account!$AA$2","v":0},{"$f":"Usage!$Y157","v":0},{"$f":"Usage!$Z157","v":0},0]
[{"$f":"Tenant!$A158","v":157},{"$f":"Account!$C$2","v":0},{"$f":"Account!$I$2","v":0},{"$f":"Tenant!$B158","v":0},{"$f":"Tenant!$C158","v":0},{"$f":"Tenant!$D158","v":0},{"$f":"Tenant!$E158","v":0},{"$f":"Tenant!$G158","v":0},{"$f":"Usage!$D158","v":"00:00:00"},{"$f":"Usage!$E158","v":"00:00:00"},{"$f":"Usage!$F158","v":0},{"$f":"Usage!$G158","v":0},{"$f":"Usage!$H158","v":0},{"$f":"Usage!$L158","v":0},{"$f":"Account!$AI$2","v":0},{"$f":"Usage!$N158","v":0},{"$f":"Usage!$M158","v":0},{"$f":"Account!$AH$2","v":0},{"$f":"Usage!$O158","v":0},0,{"$f":"Tenant!$H158","v":0},{"$f":"Account!$Y$2/100","v":0},{"$f":"Usage!$R158","v":0},{"$f":"Account!$X$2/100","v":0},{"$f":"Usage!$S158","v":0},{"$f":"Tenant!$I158","v":0},{"$f":"Usage!$V158","v":0},{"$f":"Account!$AB$2","v":0},{"$f":"Usage!$X158","v":0},{"$f":"Usage!$W158","v":0},{"$f":"Account!$AA$2","v":0},{"$f":"Usage!$Y158","v":0},{"$f":"Usage!$Z158","v":0},0]
[{"$f":"Tenant!$A159","v":158},{"$f":"Account!$C$2","v":0},{"$f":"Account!$I$2","v":0},{"$f":"Tenant!$B159","v":0},{"$f":"Tenant!$C159","v":0},{"$f":"Tenant!$D159","v":0},{"$f":"Tenant!$E159","v":0},{"$f":"Tenant!$G159","v":0},{"$f":"Usage!$D159","v":"00:00:00"},{"$f":"Usage!$E159","v":"00:00:00"},{"$f":"Usage!$F159","v":0},{"$f":"Usage!$G159","v":0},{"$f":"Usage!$H159","v":0},{"$f":"Usage!$L159","v":0},{"$f":"Account!$AI$2","v":0},{"$f":"Usage!$N159","v":0},{"$f":"Usage!$M159","v":0},{"$f":"Account!$AH$2","v":0},{"$f":"Usage!$O159","v":0},0,{"$f":"Tenant!$H159","v":0},{"$f":"Account!$Y$2/100","v":0},{"$f":"Usage!$R159","v":0},{"$f":"Account!$X$2/100","v":0},{"$f":"Usage!$S159","v":0},{"$f":"Tenant!$I159","v":0},{"$f":"Usage!$V159","v":0},{"$f":"Account!$AB$2","v":0},{"$f":"Usage!$X159","v":0},{"$f":"Usage!$W159","v":0},{"$f":"Account!$AA$2","v":0},{"$f":"Usage!$Y159","v":0},{"$f":"Usage!$Z159","v":0},0]
[{"$f":"Tenant!$A160","v":159},{"$f":"Account!$C$2","v":0},{"$f":"Account!$I$2","v":0},{"$f":"Tenant!$B160","v":0},{"$f":"Tenant!$C160","v":0},{"$f":"Tenant!$D160","v":0},{"$f":"Tenant!$E160","v":0},{"$f":"Tenant!$G160","v":0},{"$f":"Usage!$D160","v":"00:00:00"},{"$f":"Usage!$E160","v":"00:00:00"},{"$f":"Usage!$F160","v":0},{"$f":"Usage!$G160","v":0},{"$f":"Usage!$H160","v":0},{"$f":"Usage!$L160","v":0},{"$f":"Account!$AI$2","v":0},{"$f":"Usage!$N160","v":0},{"$f":"Usage!$M160","v":0},{"$f":"Account!$AH$2","v":0},{"$f":"Usage!$O160","v":0},0,{"$f":"Tenant!$H160","v":0},{"$f":"Account!$Y$2/100","v":0},{"$f":"Usage!$R160","v":0},{"$f":"Account!$X$2/100","v":0},{"$f":"Usage!$S160","v":0},{"$f":"Tenant!$I160","v":0},{"$f":"Usage!$V160","v":0},{"$f":"Account!$AB$2","v":0},{"$f":"Usage!$X160","v":0},{"$f":"Usage!$W160","v":0},{"$f":"Account!$AA$2","v":0},{"$f":"Usage!$Y160","v":0},{"$f":"Usage!$Z160","v":0},0]
[{"$f":"Tenant!$A161","v":160},{"$f":"Account!$C$2","v":0},{"$f":"Account!$I$2","v":0},{"$f":"Tenant!$B161","v":0},{"$f":"Tenant!$C161","v":0},{"$f":"Tenant!$D161","v":0},{"$f":"Tenant!$E161","v":0},{"$f":"Tenant!$G161","v":0},{"$f":"Usage!$D161","v":"00:00:00"},{"$f":"Usage!$E161","v":"00:00:00"},{"$f":"Usage!$F161","v":0},{"$f":"Usage!$G161","v":0},{"$f":"Usage!$H161","v":0},{"$f":"Usage!$L161","v":0},{"$f":"Account!$AI$2","v":0},{"$f":"Usage!$N161","v":0},{"$f":"Usage!$M161","v":0},{"$f":"Account!$AH$2","v":0},{"$f":"Usage!$O161","v":0},0,{"$f":"Tenant!$H161","v":0},{"$f":"Account!$Y$2/100","v":0},{"$f":"Usage!$R161","v":0},{"$f":"Account!$X$2/100","v":0},{"$f":"Usage!$S161","v":0},{"$f":"Tenant!$I161","v":0},{"$f":"Usage!$V161","v":0},{"$f":"Account!$AB$2","v":0},{"$f":"Usage!$X161","v":0},{"$f":"Usage!$W161","v":0},{"$f":"Account!$AA$2","v":0},{"$f":"Usage!$Y161","v":0},{"$f":"Usage!$Z161","v":0},0]
[{"$f":"Tenant!$A162","v":161},{"$f":"Account!$C$2","v":0},{"$f":"Account!$I$2","v":0},{"$f":"Tenant!$B162","v":0},{"$f":"Tenant!$C162","v":0},{"$f":"Tenant!$D162","v":0},{"$f":"Tenant!$E162","v":0},{"$f":"Tenant!$G162","v":0},{"$f":"Usage!$D162","v":"00:00:00"},{"$f":"Usage!$E162","v":"00:00:00"},{"$f":"Usage!$F162","v":0},{"$f":"Usage!$G162","v":0},{"$f":"Usage!$H162","v":0},{"$f":"Usage!$L162","v":0},{"$f":"Account!$AI$2","v":0},{"$f":"Usage!$N162","v":0},{"$f":"Usage!$M162","v":0},{"$f":"Account!$AH$2","v":0},{"$f":"Usage!$O162","v":0},0,{"$f":"Tenant!$H162","v":0},{"$f":"Account!$Y$2/100","v":0},{"$f":"Usage!$R162","v":0},{"$f":"Account!$X$2/100","v":0},{"$f":"Usage!$S162","v":0},{"$f":"Tenant!$I162","v":0},{"$f":"Usage!$V162","v":0},{"$f":"Account!$AB$2","v":0},{"$f":"Usage!$X162","v":0},{"$f":"Usage!$W162","v":0},{"$f":"Account!$AA$2","v":0},{"$f":"Usage!$Y162","v":0},{"$f":"Usage!$Z162","v":0},0]
[{"$f":"Tenant!$A163","v":162},{"$f":"Account!$C$2","v":0},{"$f":"Account!$I$2","v":0},{"$f":"Tenant!$B163","v":0},{"$f":"Tenant!$C163","v":0},{"$f":"Tenant!$D163","v":0},{"$f":"Tenant!$E163","v":0},{"$f":"Tenant!$G163","v":0},{"$f":"Usage!$D163","v":"00:00:00"},{"$f":"Usage!$E163","v":"00:00:00"},{"$f":"Usage!$F163","v":0},{"$f":"Usage!$G163","v":0},{"$f":"Usage!$H163","v":0},{"$f":"Usage!$L163","v":0},{"$f":"Account!$AI$2","v":0},{"$f":"Usage!$N163","v":0},{"$f":"Usage!$M163","v":0},{"$f":"Account!$AH$2","v":0},{"$f":"Usage!$O163","v":0},0,{"$f":"Tenant!$H163","v":0},{"$f":"Account!$Y$2/100","v":0},{"$f":"Usage!$R163","v":0},{"$f":"Account!$X$2/100","v":0},{"$f":"Usage!$S163","v":0},{"$f":"Tenant!$I163","v":0},{"$f":"Usage!$V163","v":0},{"$f":"Account!$AB$2","v":0},{"$f":"Usage!$X163","v":0},{"$f":"Usage!$W163","v":0},{"$f":"Account!$AA$2","v":0},{"$f":"Usage!$Y163","v":0},{"$f":"Usage!$Z163","v":0},0]
[{"$f":"Tenant!$A164","v":163},{"$f":"Account!$C$2","v":0},{"$f":"Account!$I$2","v":0},{"$f":"Tenant!$B164","v":0},{"$f":"Tenant!$C164","v":0},{"$f":"Tenant!$D164","v":0},{"$f":"Tenant!$E164","v":0},{"$f":"Tenant!$G164","v":0},{"$f":"Usage!$D164","v":"00:00:00"},{"$f":"Usage!$E164","v":"00:00:00"},{"$f":"Usage!$F164","v":0},{"$f":"Usage!$G164","v":0},{"$f":"Usage!$H164","v":0},{"$f":"Usage!$L164","v":0},{"$f":"Account!$AI$2","v":0},{"$f":"Usage!$N164","v":0},{"$f":"Usage!$M164","v":0},{"$f":"Account!$AH$2","v":0},{"$f":"Usage!$O164","v":0},0,{"$f":"Tenant!$H164","v":0},{"$f":"Account!$Y$2/100","v":0},{"$f":"Usage!$R164","v":0},{"$f":"Account!$X$2/100","v":0},{"$f":"Usage!$S164","v":0},{"$f":"Tenant!$I164","v":0},{"$f":"Usage!$V164","v":0},{"$f":"Account!$AB$2","v":0},{"$f":"Usage!$X164","v":0},{"$f":"Usage!$W164","v":0},{"$f":"Account!$AA$2","v":0},{"$f":"Usage!$Y164","v":0},{"$f":"Usage!$Z164","v":0},0]
[{"$f":"Tenant!$A165","v":164},{"$f":"Account!$C$2","v":0},{"$f":"Account!$I$2","v":0},{"$f":"Tenant!$B165","v":0},{"$f":"Tenant!$C165","v":0},{"$f":"Tenant!$D165","v":0},{"$f":"Tenant!$E165","v":0},{"$f":"Tenant!$G165","v":0},{"$f":"Usage!$D165","v":"00:00:00"},{"$f":"Usage!$E165","v":"00:00:00"},{"$f":"Usage!$F165","v":0},{"$f":"Usage!$G165","v":0},{"$f":"Usage!$H165","v":0},{"$f":"Usage!$L165","v":0},{"$f":"Account!$AI$2","v":0},{"$f":"Usage!$N165","v":0},{"$f":"Usage!$M165","v":0},{"$f":"Account!$AH$2","v":0},{"$f":"Usage!$O165","v":0},0,{"$f":"Tenant!$H165","v":0},{"$f":"Account!$Y$2/100","v":0},{"$f":"Usage!$R165","v":0},{"$f":"Account!$X$2/100","v":0},{"$f":"Usage!$S165","v":0},{"$f":"Tenant!$I165","v":0},{"$f":"Usage!$V165","v":0},{"$f":"Account!$AB$2","v":0},{"$f":"Usage!$X165","v":0},{"$f":"Usage!$W165","v":0},{"$f":"Account!$AA$2","v":0},{"$f":"Usage!$Y165","v":0},{"$f":"Usage!$Z165","v":0},0]
[{"$f":"Tenant!$A166","v":165},{"$f":"Account!$C$2","v":0},{"$f":"Account!$I$2","v":0},{"$f":"Tenant!$B166","v":0},{"$f":"Tenant!$C166","v":0},{"$f":"Tenant!$D166","v":0},{"$f":"Tenant!$E166","v":0},{"$f":"Tenant!$G166","v":0},{"$f":"Usage!$D166","v":"00:00:00"},{"$f":"Usage!$E166","v":"00:00:00"},{"$f":"Usage!$F166","v":0},{"$f":"Usage!$G166","v":0},{"$f":"Usage!$H166","v":0},{"$f":"Usage!$L166","v":0},{"$f":"Account!$AI$2","v":0},{"$f":"Usage!$N166","v":0},{"$f":"Usage!$M166","v":0},{"$f":"Account!$AH$2","v":0},{"$f":"Usage!$O166","v":0},0,{"$f":"Tenant!$H166","v":0},{"$f":"Account!$Y$2/100","v":0},{"$f":"Usage!$R166","v":0},{"$f":"Account!$X$2/100","v":0},{"$f":"Usage!$S166","v":0},{"$f":"Tenant!$I166","v":0},{"$f":"Usage!$V166","v":0},{"$f":"Account!$AB$2","v":0},{"$f":"Usage!$X166","v":0},{"$f":"Usage!$W166","v":0},{"$f":"Account!$AA$2","v":0},{"$f":"Usage!$Y166","v":0},{"$f":"Usage!$Z166","v":0},0]
[{"$f":"Tenant!$A167","v":166},{"$f":"Account!$C$2","v":0},{"$f":"Account!$I$2","v":0},{"$f":"Tenant!$B167","v":0},{"$f":"Tenant!$C167","v":0},{"$f":"Tenant!$D167","v":0},{"$f":"Tenant!$E167","v":0},{"$f":"Tenant!$G167","v":0},{"$f":"Usage!$D167","v":"00:00:00"},{"$f":"Usage!$E167","v":"00:00:00"},{"$f":"Usage!$F167","v":0},{"$f":"Usage!$G167","v":0},{"$f":"Usage!$H167","v":0},{"$f":"Usage!$L167","v":0},{"$f":"Account!$AI$2","v":0},{"$f":"Usage!$N167","v":0},{"$f":"Usage!$M167","v":0},{"$f":"Account!$AH$2","v":0},{"$f":"Usage!$O167","v":0},0,{"$f":"Tenant!$H167","v":0},{"$f":"Account!$Y$2/100","v":0},{"$f":"Usage!$R167","v":0},{"$f":"Account!$X$2/100","v":0},{"$f":"Usage!$S167","v":0},{"$f":"Tenant!$I167","v":0},{"$f":"Usage!$V167","v":0},{"$f":"Account!$AB$2","v":0},{"$f":"Usage!$X167","v":0},{"$f":"Usage!$W167","v":0},{"$f":"Account!$AA$2","v":0},{"$f":"Usage!$Y167","v":0},{"$f":"Usage!$Z167","v":0},0]
[{"$f":"Tenant!$A168","v":167},{"$f":"Account!$C$2","v":0},{"$f":"Account!$I$2","v":0},{"$f":"Tenant!$B168","v":0},{"$f":"Tenant!$C168","v":0},{"$f":"Tenant!$D168","v":0},{"$f":"Tenant!$E168","v":0},{"$f":"Tenant!$G168","v":0},{"$f":"Usage!$D168","v":"00:00:00"},{"$f":"Usage!$E168","v":"00:00:00"},{"$f":"Usage!$F168","v":0},{"$f":"Usage!$G168","v":0},{"$f":"Usage!$H168","v":0},{"$f":"Usage!$L168","v":0},{"$f":"Account!$AI$2","v":0},{"$f":"Usage!$N168","v":0},{"$f":"Usage!$M168","v":0},{"$f":"Account!$AH$2","v":0},{"$f":"Usage!$O168","v":0},0,{"$f":"Tenant!$H168","v":0},{"$f":"Account!$Y$2/100","v":0},{"$f":"Usage!$R168","v":0},{"$f":"Account!$X$2/100","v":0},{"$f":"Usage!$S168","v":0},{"$f":"Tenant!$I168","v":0},{"$f":"Usage!$V168","v":0},{"$f":"Account!$AB$2","v":0},{"$f":"Usage!$X168","v":0},{"$f":"Usage!$W168","v":0},{"$f":"Account!$AA$2","v":0},{"$f":"Usage!$Y168","v":0},{"$f":"Usage!$Z168","v":0},0]
[{"$f":"Tenant!$A169","v":168},{"$f":"Account!$C$2","v":0},{"$f":"Account!$I$2","v":0},{"$f":"Tenant!$B169","v":0},{"$f":"Tenant!$C169","v":0},{"$f":"Tenant!$D169","v":0},{"$f":"Tenant!$E169","v":0},{"$f":"Tenant!$G169","v":0},{"$f":"Usage!$D169","v":"00:00:00"},{"$f":"Usage!$E169","v":"00:00:00"},{"$f":"Usage!$F169","v":0},{"$f":"Usage!$G169","v":0},{"$f":"Usage!$H169","v":0},{"$f":"Usage!$L169","v":0},{"$f":"Account!$AI$2","v":0},{"$f":"Usage!$N169","v":0},{"$f":"Usage!$M169","v":0},{"$f":"Account!$AH$2","v":0},{"$f":"Usage!$O169","v":0},0,{"$f":"Tenant!$H169","v":0},{"$f":"Account!$Y$2/100","v":0},{"$f":"Usage!$R169","v":0},{"$f":"Account!$X$2/100","v":0},{"$f":"Usage!$S169","v":0},{"$f":"Tenant!$I169","v":0},{"$f":"Usage!$V169","v":0},{"$f":"Account!$AB$2","v":0},{"$f":"Usage!$X169","v":0},{"$f":"Usage!$W169","v":0},{"$f":"Account!$AA$2","v":0},{"$f":"Usage!$Y169","v":0},{"$f":"Usage!$Z169","v":0},0]
[{"$f":"Tenant!$A170","v":169},{"$f":"Account!$C$2","v":0},{"$f":"Account!$I$2","v":0},{"$f":"Tenant!$B170","v":0},{"$f":"Tenant!$C170","v":0},{"$f":"Tenant!$D170","v":0},{"$f":"Tenant!$E170","v":0},{"$f":"Tenant!$G170","v":0},{"$f":"Usage!$D170","v":"00:00:00"},{"$f":"Usage!$E170","v":"00:00:00"},{"$f":"Usage!$F170","v":0},{"$f":"Usage!$G170","v":0},{"$f":"Usage!$H170","v":0},{"$f":"Usage!$L170","v":0},{"$f":"Account!$AI$2","v":0},{"$f":"Usage!$N170","v":0},{"$f":"Usage!$M170","v":0},{"$f":"Account!$AH$2","v":0},{"$f":"Usage!$O170","v":0},0,{"$f":"Tenant!$H170","v":0},{"$f":"Account!$Y$2/100","v":0},{"$f":"Usage!$R170","v":0},{"$f":"Account!$X$2/100","v":0},{"$f":"Usage!$S170","v":0},{"$f":"Tenant!$I170","v":0},{"$f":"Usage!$V170","v":0},{"$f":"Account!$AB$2","v":0},{"$f":"Usage!$X170","v":0},{"$f":"Usage!$W170","v":0},{"$f":"Account!$AA$2","v":0},{"$f":"Usage!$Y170","v":0},{"$f":"Usage!$Z170","v":0},0]
[{"$f":"Tenant!$A171","v":170},{"$f":"Account!$C$2","v":0},{"$f":"Account!$I$2","v":0},{"$f":"Tenant!$B171","v":0},{"$f":"Tenant!$C171","v":0},{"$f":"Tenant!$D171","v":0},{"$f":"Tenant!$E171","v":0},{"$f":"Tenant!$G171","v":0},{"$f":"Usage!$D171","v":"00:00:00"},{"$f":"Usage!$E171","v":"00:00:00"},{"$f":"Usage!$F171","v":0},{"$f":"Usage!$G171","v":0},{"$f":"Usage!$H171","v":0},{"$f":"Usage!$L171","v":0},{"$f":"Account!$AI$2","v":0},{"$f":"Usage!$N171","v":0},{"$f":"Usage!$M171","v":0},{"$f":"Account!$AH$2","v":0},{"$f":"Usage!$O171","v":0},0,{"$f":"Tenant!$H171","v":0},{"$f":"Account!$Y$2/100","v":0},{"$f":"Usage!$R171","v":0},{"$f":"Account!$X$2/100","v":0},{"$f":"Usage!$S171","v":0},{"$f":"Tenant!$I171","v":0},{"$f":"Usage!$V171","v":0},{"$f":"Account!$AB$2","v":0},{"$f":"Usage!$X171","v":0},{"$f":"Usage!$W171","v":0},{"$f":"Account!$AA$2","v":0},{"$f":"Usage!$Y171","v":0},{"$f":"Usage!$Z171","v":0},0]
[{"$f":"Tenant!$A172","v":171},{"$f":"Account!$C$2","v":0},{"$f":"Account!$I$2","v":0},{"$f":"Tenant!$B172","v":0},{"$f":"Tenant!$C172","v":0},{"$f":"Tenant!$D172","v":0},{"$f":"Tenant!$E172","v":0},{"$f":"Tenant!$G172","v":0},{"$f":"Usage!$D172","v":"00:00:00"},{"$f":"Usage!$E172","v":"00:00:00"},{"$f":"Usage!$F172","v":0},{"$f":"Usage!$G172","v":0},{"$f":"Usage!$H172","v":0},{"$f":"Usage!$L172","v":0},{"$f":"Account!$AI$2","v":0},{"$f":"Usage!$N172","v":0},{"$f":"Usage!$M172","v":0},{"$f":"Account!$AH$2","v":0},{"$f":"Usage!$O172","v":0},0,{"$f":"Tenant!$H172","v":0},{"$f":"Account!$Y$2/100","v":0},{"$f":"Usage!$R172","v":0},{"$f":"Account!$X$2/100","v":0},{"$f":"Usage!$S172","v":0},{"$f":"Tenant!$I172","v":0},{"$f":"Usage!$V172","v":0},{"$f":"Account!$AB$2","v":0},{"$f":"Usage!$X172","v":0},{"$f":"Usage!$W172","v":0},{"$f":"Account!$AA$2","v":0},{"$f":"Usage!$Y172","v":0},{"$f":"Usage!$Z172","v":0},0]
[{"$f":"Tenant!$A173","v":172},{"$f":"Account!$C$2","v":0},{"$f":"Account!$I$2","v":0},{"$f":"Tenant!$B173","v":0},{"$f":"Tenant!$C173","v":0},{"$f":"Tenant!$D173","v":0},{"$f":"Tenant!$E173","v":0},{"$f":"Tenant!$G173","v":0},{"$f":"Usage!$D173","v":"00:00:00"},{"$f":"Usage!$E173","v":"00:00:00"},{"$f":"Usage!$F173","v":0},{"$f":"Usage!$G173","v":0},{"$f":"Usage!$H173","v":0},{"$f":"Usage!$L173","v":0},{"$f":"Account!$AI$2","v":0},{"$f":"Usage!$N173","v":0},{"$f":"Usage!$M173","v":0},{"$f":"Account!$AH$2","v":0},{"$f":"Usage!$O173","v":0},0,{"$f":"Tenant!$H173","v":0},{"$f":"Account!$Y$2/100","v":0},{"$f":"Usage!$R173","v":0},{"$f":"Account!$X$2/100","v":0},{"$f":"Usage!$S173","v":0},{"$f":"Tenant!$I173","v":0},{"$f":"Usage!$V173","v":0},{"$f":"Account!$AB$2","v":0},{"$f":"Usage!$X173","v":0},{"$f":"Usage!$W173","v":0},{"$f":"Account!$AA$2","v":0},{"$f":"Usage!$Y173","v":0},{"$f":"Usage!$Z173","v":0},0]
[{"$f":"Tenant!$A174","v":173},{"$f":"Account!$C$2","v":0},{"$f":"Account!$I$2","v":0},{"$f":"Tenant!$B174","v":0},{"$f":"Tenant!$C174","v":0},{"$f":"Tenant!$D174","v":0},{"$f":"Tenant!$E174","v":0},{"$f":"Tenant!$G174","v":0},{"$f":"Usage!$D174","v":"00:00:00"},{"$f":"Usage!$E174","v":"00:00:00"},{"$f":"Usage!$F174","v":0},{"$f":"Usage!$G174","v":0},{"$f":"Usage!$H174","v":0},{"$f":"Usage!$L174","v":0},{"$f":"Account!$AI$2","v":0},{"$f":"Usage!$N174","v":0},{"$f":"Usage!$M174","v":0},{"$f":"Account!$AH$2","v":0},{"$f":"Usage!$O174","v":0},0,{"$f":"Tenant!$H174","v":0},{"$f":"Account!$Y$2/100","v":0},{"$f":"Usage!$R174","v":0},{"$f":"Account!$X$2/100","v":0},{"$f":"Usage!$S174","v":0},{"$f":"Tenant!$I174","v":0},{"$f":"Usage!$V174","v":0},{"$f":"Account!$AB$2","v":0},{"$f":"Usage!$X174","v":0},{"$f":"Usage!$W174","v":0},{"$f":"Account!$AA$2","v":0},{"$f":"Usage!$Y174","v":0},{"$f":"Usage!$Z174","v":0},0]
[{"$f":"Tenant!$A175","v":174},{"$f":"Account!$C$2","v":0},{"$f":"Account!$I$2","v":0},{"$f":"Tenant!$B175","v":0},{"$f":"Tenant!$C175","v":0},{"$f":"Tenant!$D175","v":0},{"$f":"Tenant!$E175","v":0},{"$f":"Tenant!$G175","v":0},{"$f":"Usage!$D175","v":"00:00:00"},{"$f":"Usage!$E175","v":"00:00:00"},{"$f":"Usage!$F175","v":0},{"$f":"Usage!$G175","v":0},{"$f":"Usage!$H175","v":0},{"$f":"Usage!$L175","v":0},{"$f":"Account!$AI$2","v":0},{"$f":"Usage!$N175","v":0},{"$f":"Usage!$M175","v":0},{"$f":"Account!$AH$2","v":0},{"$f":"Usage!$O175","v":0},0,{"$f":"Tenant!$H175","v":0},{"$f":"Account!$Y$2/100","v":0},{"$f":"Usage!$R175","v":0},{"$f":"Account!$X$2/100","v":0},{"$f":"Usage!$S175","v":0},{"$f":"Tenant!$I175","v":0},{"$f":"Usage!$V175","v":0},{"$f":"Account!$AB$2","v":0},{"$f":"Usage!$X175","v":0},{"$f":"Usage!$W175","v":0},{"$f":"Account!$AA$2","v":0},{"$f":"Usage!$Y175","v":0},{"$f":"Usage!$Z175","v":0},0]
[{"$f":"Tenant!$A176","v":175},{"$f":"Account!$C$2","v":0},{"$f":"Account!$I$2","v":0},{"$f":"Tenant!$B176","v":0},{"$f":"Tenant!$C176","v":0},{"$f":"Tenant!$D176","v":0},{"$f":"Tenant!$E176","v":0},{"$f":"Tenant!$G176","v":0},{"$f":"Usage!$D176","v":"00:00:00"},{"$f":"Usage!$E176","v":"00:00:00"},{"$f":"Usage!$F176","v":0},{"$f":"Usage!$G176","v":0},{"$f":"Usage!$H176","v":0},{"$f":"Usage!$L176","v":0},{"$f":"Account!$AI$2","v":0},{"$f":"Usage!$N176","v":0},{"$f":"Usage!$M176","v":0},{"$f":"Account!$AH$2","v":0},{"$f":"Usage!$O176","v":0},0,{"$f":"Tenant!$H176","v":0},{"$f":"Account!$Y$2/100","v":0},{"$f":"Usage!$R176","v":0},{"$f":"Account!$X$2/100","v":0},{"$f":"Usage!$S176","v":0},{"$f":"Tenant!$I176","v":0},{"$f":"Usage!$V176","v":0},{"$f":"Account!$AB$2","v":0},{"$f":"Usage!$X176","v":0},{"$f":"Usage!$W176","v":0},{"$f":"Account!$AA$2","v":0},{"$f":"Usage!$Y176","v":0},{"$f":"Usage!$Z176","v":0},0]
[{"$f":"Tenant!$A177","v":176},{"$f":"Account!$C$2","v":0},{"$f":"Account!$I$2","v":0},{"$f":"Tenant!$B177","v":0},{"$f":"Tenant!$C177","v":0},{"$f":"Tenant!$D177","v":0},{"$f":"Tenant!$E177","v":0},{"$f":"Tenant!$G177","v":0},{"$f":"Usage!$D177","v":"00:00:00"},{"$f":"Usage!$E177","v":"00:00:00"},{"$f":"Usage!$F177","v":0},{"$f":"Usage!$G177","v":0},{"$f":"Usage!$H177","v":0},{"$f":"Usage!$L177","v":0},{"$f":"Account!$AI$2","v":0},{"$f":"Usage!$N177","v":0},{"$f":"Usage!$M177","v":0},{"$f":"Account!$AH$2","v":0},{"$f":"Usage!$O177","v":0},0,{"$f":"Tenant!$H177","v":0},{"$f":"Account!$Y$2/100","v":0},{"$f":"Usage!$R177","v":0},{"$f":"Account!$X$2/100","v":0},{"$f":"Usage!$S177","v":0},{"$f":"Tenant!$I177","v":0},{"$f":"Usage!$V177","v":0},{"$f":"Account!$AB$2","v":0},{"$f":"Usage!$X177","v":0},{"$f":"Usage!$W177","v":0},{"$f":"Account!$AA$2","v":0},{"$f":"Usage!$Y177","v":0},{"$f":"Usage!$Z177","v":0},0]
[{"$f":"Tenant!$A178","v":177},{"$f":"Account!$C$2","v":0},{"$f":"Account!$I$2","v":0},{"$f":"Tenant!$B178","v":0},{"$f":"Tenant!$C178","v":0},{"$f":"Tenant!$D178","v":0},{"$f":"Tenant!$E178","v":0},{"$f":"Tenant!$G178","v":0},{"$f":"Usage!$D178","v":"00:00:00"},{"$f":"Usage!$E178","v":"00:00:00"},{"$f":"Usage!$F178","v":0},{"$f":"Usage!$G178","v":0},{"$f":"Usage!$H178","v":0},{"$f":"Usage!$L178","v":0},{"$f":"Account!$AI$2","v":0},{"$f":"Usage!$N178","v":0},{"$f":"Usage!$M178","v":0},{"$f":"Account!$AH$2","v":0},{"$f":"Usage!$O178","v":0},0,{"$f":"Tenant!$H178","v":0},{"$f":"Account!$Y$2/100","v":0},{"$f":"Usage!$R178","v":0},{"$f":"Account!$X$2/100","v":0},{"$f":"Usage!$S178","v":0},{"$f":"Tenant!$I178","v":0},{"$f":"Usage!$V178","v":0},{"$f":"Account!$AB$2","v":0},{"$f":"Usage!$X178","v":0},{"$f":"Usage!$W178","v":0},{"$f":"Account!$AA$2","v":0},{"$f":"Usage!$Y178","v":0},{"$f":"Usage!$Z178","v":0},0]
[{"$f":"Tenant!$A179","v":178},{"$f":"Account!$C$2","v":0},{"$f":"Account!$I$2","v":0},{"$f":"Tenant!$B179","v":0},{"$f":"Tenant!$C179","v":0},{"$f":"Tenant!$D179","v":0},{"$f":"Tenant!$E179","v":0},{"$f":"Tenant!$G179","v":0},{"$f":"Usage!$D179","v":"00:00:00"},{"$f":"Usage!$E179","v":"00:00:00"},{"$f":"Usage!$F179","v":0},{"$f":"Usage!$G179","v":0},{"$f":"Usage!$H179","v":0},{"$f":"Usage!$L179","v":0},{"$f":"Account!$AI$2","v":0},{"$f":"Usage!$N179","v":0},{"$f":"Usage!$M179","v":0},{"$f":"Account!$AH$2","v":0},{"$f":"Usage!$O179","v":0},0,{"$f":"Tenant!$H179","v":0},{"$f":"Account!$Y$2/100","v":0},{"$f":"Usage!$R179","v":0},{"$f":"Account!$X$2/100","v":0},{"$f":"Usage!$S179","v":0},{"$f":"Tenant!$I179","v":0},{"$f":"Usage!$V179","v":0},{"$f":"Account!$AB$2","v":0},{"$f":"Usage!$X179","v":0},{"$f":"Usage!$W179","v":0},{"$f":"Account!$AA$2","v":0},{"$f":"Usage!$Y179","v":0},{"$f":"Usage!$Z179","v":0},0]
[{"$f":"Tenant!$A180","v":179},{"$f":"Account!$C$2","v":0},{"$f":"Account!$I$2","v":0},{"$f":"Tenant!$B180","v":0},{"$f":"Tenant!$C180","v":0},{"$f":"Tenant!$D180","v":0},{"$f":"Tenant!$E180","v":0},{"$f":"Tenant!$G180","v":0},{"$f":"Usage!$D180","v":"00:00:00"},{"$f":"Usage!$E180","v":"00:00:00"},{"$f":"Usage!$F180","v":0},{"$f":"Usage!$G180","v":0},{"$f":"Usage!$H180","v":0},{"$f":"Usage!$L180","v":0},{"$f":"Account!$AI$2","v":0},{"$f":"Usage!$N180","v":0},{"$f":"Usage!$M180","v":0},{"$f":"Account!$AH$2","v":0},{"$f":"Usage!$O180","v":0},0,{"$f":"Tenant!$H180","v":0},{"$f":"Account!$Y$2/100","v":0},{"$f":"Usage!$R180","v":0},{"$f":"Account!$X$2/100","v":0},{"$f":"Usage!$S180","v":0},{"$f":"Tenant!$I180","v":0},{"$f":"Usage!$V180","v":0},{"$f":"Account!$AB$2","v":0},{"$f":"Usage!$X180","v":0},{"$f":"Usage!$W180","v":0},{"$f":"Account!$AA$2","v":0},{"$f":"Usage!$Y180","v":0},{"$f":"Usage!$Z180","v":0},0]
[{"$f":"Tenant!$A181","v":180},{"$f":"Account!$C$2","v":0},{"$f":"Account!$I$2","v":0},{"$f":"Tenant!$B181","v":0},{"$f":"Tenant!$C181","v":0},{"$f":"Tenant!$D181","v":0},{"$f":"Tenant!$E181","v":0},{"$f":"Tenant!$G181","v":0},{"$f":"Usage!$D181","v":"00:00:00"},{"$f":"Usage!$E181","v":"00:00:00"},{"$f":"Usage!$F181","v":0},{"$f":"Usage!$G181","v":0},{"$f":"Usage!$H181","v":0},{"$f":"Usage!$L181","v":0},{"$f":"Account!$AI$2","v":0},{"$f":"Usage!$N181","v":0},{"$f":"Usage!$M181","v":0},{"$f":"Account!$AH$2","v":0},{"$f":"Usage!$O181","v":0},0,{"$f":"Tenant!$H181","v":0},{"$f":"Account!$Y$2/100","v":0},{"$f":"Usage!$R181","v":0},{"$f":"Account!$X$2/100","v":0},{"$f":"Usage!$S181","v":0},{"$f":"Tenant!$I181","v":0},{"$f":"Usage!$V181","v":0},{"$f":"Account!$AB$2","v":0},{"$f":"Usage!$X181","v":0},{"$f":"Usage!$W181","v":0},{"$f":"Account!$AA$2","v":0},{"$f":"Usage!$Y181","v":0},{"$f":"Usage!$Z181","v":0},0]
[{"$f":"Tenant!$A182","v":181},{"$f":"Account!$C$2","v":0},{"$f":"Account!$I$2","v":0},{"$f":"Tenant!$B182","v":0},{"$f":"Tenant!$C182","v":0},{"$f":"Tenant!$D182","v":0},{"$f":"Tenant!$E182","v":0},{"$f":"Tenant!$G182","v":0},{"$f":"Usage!$D182","v":"00:00:00"},{"$f":"Usage!$E182","v":"00:00:00"},{"$f":"Usage!$F182","v":0},{"$f":"Usage!$G182","v":0},{"$f":"Usage!$H182","v":0},{"$f":"Usage!$L182","v":0},{"$f":"Account!$AI$2","v":0},{"$f":"Usage!$N182","v":0},{"$f":"Usage!$M182","v":0},{"$f":"Account!$AH$2","v":0},{"$f":"Usage!$O182","v":0},0,{"$f":"Tenant!$H182","v":0},{"$f":"Account!$Y$2/100","v":0},{"$f":"Usage!$R182","v":0},{"$f":"Account!$X$2/100","v":0},{"$f":"Usage!$S182","v":0},{"$f":"Tenant!$I182","v":0},{"$f":"Usage!$V182","v":0},{"$f":"Account!$AB$2","v":0},{"$f":"Usage!$X182","v":0},{"$f":"Usage!$W182","v":0},{"$f":"Account!$AA$2","v":0},{"$f":"Usage!$Y182","v":0},{"$f":"Usage!$Z182","v":0},0]
[{"$f":"Tenant!$A183","v":182},{"$f":"Account!$C$2","v":0},{"$f":"Account!$I$2","v":0},{"$f":"Tenant!$B183","v":0},{"$f":"Tenant!$C183","v":0},{"$f":"Tenant!$D183","v":0},{"$f":"Tenant!$E183","v":0},{"$f":"Tenant!$G183","v":0},{"$f":"Usage!$D183","v":"00:00:00"},{"$f":"Usage!$E183","v":"00:00:00"},{"$f":"Usage!$F183","v":0},{"$f":"Usage!$G183","v":0},{"$f":"Usage!$H183","v":0},{"$f":"Usage!$L183","v":0},{"$f":"Account!$AI$2","v":0},{"$f":"Usage!$N183","v":0},{"$f":"Usage!$M183","v":0},{"$f":"Account!$AH$2","v":0},{"$f":"Usage!$O183","v":0},0,{"$f":"Tenant!$H183","v":0},{"$f":"Account!$Y$2/100","v":0},{"$f":"Usage!$R183","v":0},{"$f":"Account!$X$2/100","v":0},{"$f":"Usage!$S183","v":0},{"$f":"Tenant!$I183","v":0},{"$f":"Usage!$V183","v":0},{"$f":"Account!$AB$2","v":0},{"$f":"Usage!$X183","v":0},{"$f":"Usage!$W183","v":0},{"$f":"Account!$AA$2","v":0},{"$f":"Usage!$Y183","v":0},{"$f":"Usage!$Z183","v":0},0]
[{"$f":"Tenant!$A184","v":183},{"$f":"Account!$C$2","v":0},{"$f":"Account!$I$2","v":0},{"$f":"Tenant!$B184","v":0},{"$f":"Tenant!$C184","v":0},{"$f":"Tenant!$D184","v":0},{"$f":"Tenant!$E184","v":0},{"$f":"Tenant!$G184","v":0},{"$f":"Usage!$D184","v":"00:00:00"},{"$f":"Usage!$E184","v":"00:00:00"},{"$f":"Usage!$F184","v":0},{"$f":"Usage!$G184","v":0},{"$f":"Usage!$H184","v":0},{"$f":"Usage!$L184","v":0},{"$f":"Account!$AI$2","v":0},{"$f":"Usage!$N184","v":0},{"$f":"Usage!$M184","v":0},{"$f":"Account!$AH$2","v":0},{"$f":"Usage!$O184","v":0},0,{"$f":"Tenant!$H184","v":0},{"$f":"Account!$Y$2/100","v":0},{"$f":"Usage!$R184","v":0},{"$f":"Account!$X$2/100","v":0},{"$f":"Usage!$S184","v":0},{"$f":"Tenant!$I184","v":0},{"$f":"Usage!$V184","v":0},{"$f":"Account!$AB$2","v":0},{"$f":"Usage!$X184","v":0},{"$f":"Usage!$W184","v":0},{"$f":"Account!$AA$2","v":0},{"$f":"Usage!$Y184","v":0},{"$f":"Usage!$Z184","v":0},0]
[{"$f":"Tenant!$A185","v":184},{"$f":"Account!$C$2","v":0},{"$f":"Account!$I$2","v":0},{"$f":"Tenant!$B185","v":0},{"$f":"Tenant!$C185","v":0},{"$f":"Tenant!$D185","v":0},{"$f":"Tenant!$E185","v":0},{"$f":"Tenant!$G185","v":0},{"$f":"Usage!$D185","v":"00:00:00"},{"$f":"Usage!$E185","v":"00:00:00"},{"$f":"Usage!$F185","v":0},{"$f":"Usage!$G185","v":0},{"$f":"Usage!$H185","v":0},{"$f":"Usage!$L185","v":0},{"$f":"Account!$AI$2","v":0},{"$f":"Usage!$N185","v":0},{"$f":"Usage!$M185","v":0},{"$f":"Account!$AH$2","v":0},{"$f":"Usage!$O185","v":0},0,{"$f":"Tenant!$H185","v":0},{"$f":"Account!$Y$2/100","v":0},{"$f":"Usage!$R185","v":0},{"$f":"Account!$X$2/100","v":0},{"$f":"Usage!$S185","v":0},{"$f":"Tenant!$I185","v":0},{"$f":"Usage!$V185","v":0},{"$f":"Account!$AB$2","v":0},{"$f":"Usage!$X185","v":0},{"$f":"Usage!$W185","v":0},{"$f":"Account!$AA$2","v":0},{"$f":"Usage!$Y185","v":0},{"$f":"Usage!$Z185","v":0},0]
[{"$f":"Tenant!$A186","v":185},{"$f":"Account!$C$2","v":0},{"$f":"Account!$I$2","v":0},{"$f":"Tenant!$B186","v":0},{"$f":"Tenant!$C186","v":0},{"$f":"Tenant!$D186","v":0},{"$f":"Tenant!$E186","v":0},{"$f":"Tenant!$G186","v":0},{"$f":"Usage!$D186","v":"00:00:00"},{"$f":"Usage!$E186","v":"00:00:00"},{"$f":"Usage!$F186","v":0},{"$f":"Usage!$G186","v":0},{"$f":"Usage!$H186","v":0},{"$f":"Usage!$L186","v":0},{"$f":"Account!$AI$2","v":0},{"$f":"Usage!$N186","v":0},{"$f":"Usage!$M186","v":0},{"$f":"Account!$AH$2","v":0},{"$f":"Usage!$O186","v":0},0,{"$f":"Tenant!$H186","v":0},{"$f":"Account!$Y$2/100","v":0},{"$f":"Usage!$R186","v":0},{"$f":"Account!$X$2/100","v":0},{"$f":"Usage!$S186","v":0},{"$f":"Tenant!$I186","v":0},{"$f":"Usage!$V186","v":0},{"$f":"Account!$AB$2","v":0},{"$f":"Usage!$X186","v":0},{"$f":"Usage!$W186","v":0},{"$f":"Account!$AA$2","v":0},{"$f":"Usage!$Y186","v":0},{"$f":"Usage!$Z186","v":0},0]
[{"$f":"Tenant!$A187","v":186},{"$f":"Account!$C$2","v":0},{"$f":"Account!$I$2","v":0},{"$f":"Tenant!$B187","v":0},{"$f":"Tenant!$C187","v":0},{"$f":"Tenant!$D187","v":0},{"$f":"Tenant!$E187","v":0},{"$f":"Tenant!$G187","v":0},{"$f":"Usage!$D187","v":"00:00:00"},{"$f":"Usage!$E187","v":"00:00:00"},{"$f":"Usage!$F187","v":0},{"$f":"Usage!$G187","v":0},{"$f":"Usage!$H187","v":0},{"$f":"Usage!$L187","v":0},{"$f":"Account!$AI$2","v":0},{"$f":"Usage!$N187","v":0},{"$f":"Usage!$M187","v":0},{"$f":"Account!$AH$2","v":0},{"$f":"Usage!$O187","v":0},0,{"$f":"Tenant!$H187","v":0},{"$f":"Account!$Y$2/100","v":0},{"$f":"Usage!$R187","v":0},{"$f":"Account!$X$2/100","v":0},{"$f":"Usage!$S187","v":0},{"$f":"Tenant!$I187","v":0},{"$f":"Usage!$V187","v":0},{"$f":"Account!$AB$2","v":0},{"$f":"Usage!$X187","v":0},{"$f":"Usage!$W187","v":0},{"$f":"Account!$AA$2","v":0},{"$f":"Usage!$Y187","v":0},{"$f":"Usage!$Z187","v":0},0]
[{"$f":"Tenant!$A188","v":187},{"$f":"Account!$C$2","v":0},{"$f":"Account!$I$2","v":0},{"$f":"Tenant!$B188","v":0},{"$f":"Tenant!$C188","v":0},{"$f":"Tenant!$D188","v":0},{"$f":"Tenant!$E188","v":0},{"$f":"Tenant!$G188","v":0},{"$f":"Usage!$D188","v":"00:00:00"},{"$f":"Usage!$E188","v":"00:00:00"},{"$f":"Usage!$F188","v":0},{"$f":"Usage!$G188","v":0},{"$f":"Usage!$H188","v":0},{"$f":"Usage!$L188","v":0},{"$f":"Account!$AI$2","v":0},{"$f":"Usage!$N188","v":0},{"$f":"Usage!$M188","v":0},{"$f":"Account!$AH$2","v":0},{"$f":"Usage!$O188","v":0},0,{"$f":"Tenant!$H188","v":0},{"$f":"Account!$Y$2/100","v":0},{"$f":"Usage!$R188","v":0},{"$f":"Account!$X$2/100","v":0},{"$f":"Usage!$S188","v":0},{"$f":"Tenant!$I188","v":0},{"$f":"Usage!$V188","v":0},{"$f":"Account!$AB$2","v":0},{"$f":"Usage!$X188","v":0},{"$f":"Usage!$W188","v":0},{"$f":"Account!$AA$2","v":0},{"$f":"Usage!$Y188","v":0},{"$f":"Usage!$Z188","v":0},0]
[{"$f":"Tenant!$A189","v":188},{"$f":"Account!$C$2","v":0},{"$f":"Account!$I$2","v":0},{"$f":"Tenant!$B189","v":0},{"$f":"Tenant!$C189","v":0},{"$f":"Tenant!$D189","v":0},{"$f":"Tenant!$E189","v":0},{"$f":"Tenant!$G189","v":0},{"$f":"Usage!$D189","v":"00:00:00"},{"$f":"Usage!$E189","v":"00:00:00"},{"$f":"Usage!$F189","v":0},{"$f":"Usage!$G189","v":0},{"$f":"Usage!$H189","v":0},{"$f":"Usage!$L189","v":0},{"$f":"Account!$AI$2","v":0},{"$f":"Usage!$N189","v":0},{"$f":"Usage!$M189","v":0},{"$f":"Account!$AH$2","v":0},{"$f":"Usage!$O189","v":0},0,{"$f":"Tenant!$H189","v":0},{"$f":"Account!$Y$2/100","v":0},{"$f":"Usage!$R189","v":0},{"$f":"Account!$X$2/100","v":0},{"$f":"Usage!$S189","v":0},{"$f":"Tenant!$I189","v":0},{"$f":"Usage!$V189","v":0},{"$f":"Account!$AB$2","v":0},{"$f":"Usage!$X189","v":0},{"$f":"Usage!$W189","v":0},{"$f":"Account!$AA$2","v":0},{"$f":"Usage!$Y189","v":0},{"$f":"Usage!$Z189","v":0},0]
[{"$f":"Tenant!$A190","v":189},{"$f":"Account!$C$2","v":0},{"$f":"Account!$I$2","v":0},{"$f":"Tenant!$B190","v":0},{"$f":"Tenant!$C190","v":0},{"$f":"Tenant!$D190","v":0},{"$f":"Tenant!$E190","v":0},{"$f":"Tenant!$G190","v":0},{"$f":"Usage!$D190","v":"00:00:00"},{"$f":"Usage!$E190","v":"00:00:00"},{"$f":"Usage!$F190","v":0},{"$f":"Usage!$G190","v":0},{"$f":"Usage!$H190","v":0},{"$f":"Usage!$L190","v":0},{"$f":"Account!$AI$2","v":0},{"$f":"Usage!$N190","v":0},{"$f":"Usage!$M190","v":0},{"$f":"Account!$AH$2","v":0},{"$f":"Usage!$O190","v":0},0,{"$f":"Tenant!$H190","v":0},{"$f":"Account!$Y$2/100","v":0},{"$f":"Usage!$R190","v":0},{"$f":"Account!$X$2/100","v":0},{"$f":"Usage!$S190","v":0},{"$f":"Tenant!$I190","v":0},{"$f":"Usage!$V190","v":0},{"$f":"Account!$AB$2","v":0},{"$f":"Usage!$X190","v":0},{"$f":"Usage!$W190","v":0},{"$f":"Account!$AA$2","v":0},{"$f":"Usage!$Y190","v":0},{"$f":"Usage!$Z190","v":0},0]
[{"$f":"Tenant!$A191","v":190},{"$f":"Account!$C$2","v":0},{"$f":"Account!$I$2","v":0},{"$f":"Tenant!$B191","v":0},{"$f":"Tenant!$C191","v":0},{"$f":"Tenant!$D191","v":0},{"$f":"Tenant!$E191","v":0},{"$f":"Tenant!$G191","v":0},{"$f":"Usage!$D191","v":"00:00:00"},{"$f":"Usage!$E191","v":"00:00:00"},{"$f":"Usage!$F191","v":0},{"$f":"Usage!$G191","v":0},{"$f":"Usage!$H191","v":0},{"$f":"Usage!$L191","v":0},{"$f":"Account!$AI$2","v":0},{"$f":"Usage!$N191","v":0},{"$f":"Usage!$M191","v":0},{"$f":"Account!$AH$2","v":0},{"$f":"Usage!$O191","v":0},0,{"$f":"Tenant!$H191","v":0},{"$f":"Account!$Y$2/100","v":0},{"$f":"Usage!$R191","v":0},{"$f":"Account!$X$2/100","v":0},{"$f":"Usage!$S191","v":0},{"$f":"Tenant!$I191","v":0},{"$f":"Usage!$V191","v":0},{"$f":"Account!$AB$2","v":0},{"$f":"Usage!$X191","v":0},{"$f":"Usage!$W191","v":0},{"$f":"Account!$AA$2","v":0},{"$f":"Usage!$Y191","v":0},{"$f":"Usage!$Z191","v":0},0]
[{"$f":"Tenant!$A192","v":191},{"$f":"Account!$C$2","v":0},{"$f":"Account!$I$2","v":0},{"$f":"Tenant!$B192","v":0},{"$f":"Tenant!$C192","v":0},{"$f":"Tenant!$D192","v":0},{"$f":"Tenant!$E192","v":0},{"$f":"Tenant!$G192","v":0},{"$f":"Usage!$D192","v":"00:00:00"},{"$f":"Usage!$E192","v":"00:00:00"},{"$f":"Usage!$F192","v":0},{"$f":"Usage!$G192","v":0},{"$f":"Usage!$H192","v":0},{"$f":"Usage!$L192","v":0},{"$f":"Account!$AI$2","v":0},{"$f":"Usage!$N192","v":0},{"$f":"Usage!$M192","v":0},{"$f":"Account!$AH$2","v":0},{"$f":"Usage!$O192","v":0},0,{"$f":"Tenant!$H192","v":0},{"$f":"Account!$Y$2/100","v":0},{"$f":"Usage!$R192","v":0},{"$f":"Account!$X$2/100","v":0},{"$f":"Usage!$S192","v":0},{"$f":"Tenant!$I192","v":0},{"$f":"Usage!$V192","v":0},{"$f":"Account!$AB$2","v":0},{"$f":"Usage!$X192","v":0},{"$f":"Usage!$W192","v":0},{"$f":"Account!$AA$2","v":0},{"$f":"Usage!$Y192","v":0},{"$f":"Usage!$Z192","v":0},0]
[{"$f":"Tenant!$A193","v":192},{"$f":"Account!$C$2","v":0},{"$f":"Account!$I$2","v":0},{"$f":"Tenant!$B193","v":0},{"$f":"Tenant!$C193","v":0},{"$f":"Tenant!$D193","v":0},{"$f":"Tenant!$E193","v":0},{"$f":"Tenant!$G193","v":0},{"$f":"Usage!$D193","v":"00:00:00"},{"$f":"Usage!$E193","v":"00:00:00"},{"$f":"Usage!$F193","v":0},{"$f":"Usage!$G193","v":0},{"$f":"Usage!$H193","v":0},{"$f":"Usage!$L193","v":0},{"$f":"Account!$AI$2","v":0},{"$f":"Usage!$N193","v":0},{"$f":"Usage!$M193","v":0},{"$f":"Account!$AH$2","v":0},{"$f":"Usage!$O193","v":0},0,{"$f":"Tenant!$H193","v":0},{"$f":"Account!$Y$2/100","v":0},{"$f":"Usage!$R193","v":0},{"$f":"Account!$X$2/100","v":0},{"$f":"Usage!$S193","v":0},{"$f":"Tenant!$I193","v":0},{"$f":"Usage!$V193","v":0},{"$f":"Account!$AB$2","v":0},{"$f":"Usage!$X193","v":0},{"$f":"Usage!$W193","v":0},{"$f":"Account!$AA$2","v":0},{"$f":"Usage!$Y193","v":0},{"$f":"Usage!$Z193","v":0},0]
[{"$f":"Tenant!$A194","v":193},{"$f":"Account!$C$2","v":0},{"$f":"Account!$I$2","v":0},{"$f":"Tenant!$B194","v":0},{"$f":"Tenant!$C194","v":0},{"$f":"Tenant!$D194","v":0},{"$f":"Tenant!$E194","v":0},{"$f":"Tenant!$G194","v":0},{"$f":"Usage!$D194","v":"00:00:00"},{"$f":"Usage!$E194","v":"00:00:00"},{"$f":"Usage!$F194","v":0},{"$f":"Usage!$G194","v":0},{"$f":"Usage!$H194","v":0},{"$f":"Usage!$L194","v":0},{"$f":"Account!$AI$2","v":0},{"$f":"Usage!$N194","v":0},{"$f":"Usage!$M194","v":0},{"$f":"Account!$AH$2","v":0},{"$f":"Usage!$O194","v":0},0,{"$f":"Tenant!$H194","v":0},{"$f":"Account!$Y$2/100","v":0},{"$f":"Usage!$R194","v":0},{"$f":"Account!$X$2/100","v":0},{"$f":"Usage!$S194","v":0},{"$f":"Tenant!$I194","v":0},{"$f":"Usage!$V194","v":0},{"$f":"Account!$AB$2","v":0},{"$f":"Usage!$X194","v":0},{"$f":"Usage!$W194","v":0},{"$f":"Account!$AA$2","v":0},{"$f":"Usage!$Y194","v":0},{"$f":"Usage!$Z194","v":0},0]
[{"$f":"Tenant!$A195","v":194},{"$f":"Account!$C$2","v":0},{"$f":"Account!$I$2","v":0},{"$f":"Tenant!$B195","v":0},{"$f":"Tenant!$C195","v":0},{"$f":"Tenant!$D195","v":0},{"$f":"Tenant!$E195","v":0},{"$f":"Tenant!$G195","v":0},{"$f":"Usage!$D195","v":"00:00:00"},{"$f":"Usage!$E195","v":"00:00:00"},{"$f":"Usage!$F195","v":0},{"$f":"Usage!$G195","v":0},{"$f":"Usage!$H195","v":0},{"$f":"Usage!$L195","v":0},{"$f":"Account!$AI$2","v":0},{"$f":"Usage!$N195","v":0},{"$f":"Usage!$M195","v":0},{"$f":"Account!$AH$2","v":0},{"$f":"Usage!$O195","v":0},{"$f":"SUM($P195,$S195)","v":0},{"$f":"Tenant!$H195","v":0},{"$f":"Account!$Y$2/100","v":0},{"$f":"Usage!$R195","v":0},{"$f":"Account!$X$2/100","v":0},{"$f":"Usage!$S195","v":0},{"$f":"Tenant!$I195","v":0},{"$f":"Usage!$V195","v":0},{"$f":"Account!$AB$2","v":0},{"$f":"Usage!$X195","v":0},{"$f":"Usage!$W195","v":0},{"$f":"Account!$AA$2","v":0},{"$f":"Usage!$Y195","v":0},{"$f":"Usage!$Z195","v":0},{"$f":"$AG195","v":0}]
[{"$f":"Tenant!$A196","v":195},{"$f":"Account!$C$2","v":0},{"$f":"Account!$I$2","v":0},{"$f":"Tenant!$B196","v":0},{"$f":"Tenant!$C196","v":0},{"$f":"Tenant!$D196","v":0},{"$f":"Tenant!$E196","v":0},{"$f":"Tenant!$G196","v":0},{"$f":"Usage!$D196","v":"00:00:00"},{"$f":"Usage!$E196","v":"00:00:00"},{"$f":"Usage!$F196","v":0},{"$f":"Usage!$G196","v":0},{"$f":"Usage!$H196","v":0},{"$f":"Usage!$L196","v":0},{"$f":"Account!$AI$2","v":0},{"$f":"Usage!$N196","v":0},{"$f":"Usage!$M196","v":0},{"$f":"Account!$AH$2","v":0},{"$f":"Usage!$O196","v":0},0,{"$f":"Tenant!$H196","v":0},{"$f":"Account!$Y$2/100","v":0},{"$f":"Usage!$R196","v":0},{"$f":"Account!$X$2/100","v":0},{"$f":"Usage!$S196","v":0},{"$f":"Tenant!$I196","v":0},{"$f":"Usage!$V196","v":0},{"$f":"Account!$AB$2","v":0},{"$f":"Usage!$X196","v":0},{"$f":"Usage!$W196","v":0},{"$f":"Account!$AA$2","v":0},{"$f":"Usage!$Y196","v":0},{"$f":"Usage!$Z196","v":0},0]
[{"$f":"Tenant!$A197","v":196},{"$f":"Account!$C$2","v":0},{"$f":"Account!$I$2","v":0},{"$f":"Tenant!$B197","v":0},{"$f":"Tenant!$C197","v":0},{"$f":"Tenant!$D197","v":0},{"$f":"Tenant!$E197","v":0},{"$f":"Tenant!$G197","v":0},{"$f":"Usage!$D197","v":"00:00:00"},{"$f":"Usage!$E197","v":"00:00:00"},{"$f":"Usage!$F197","v":0},{"$f":"Usage!$G197","v":0},{"$f":"Usage!$H197","v":0},{"$f":"Usage!$L197","v":0},{"$f":"Account!$AI$2","v":0},{"$f":"Usage!$N197","v":0},{"$f":"Usage!$M197","v":0},{"$f":"Account!$AH$2","v":0},{"$f":"Usage!$O197","v":0},0,{"$f":"Tenant!$H197","v":0},{"$f":"Account!$Y$2/100","v":0},{"$f":"Usage!$R197","v":0},{"$f":"Account!$X$2/100","v":0},{"$f":"Usage!$S197","v":0},{"$f":"Tenant!$I197","v":0},{"$f":"Usage!$V197","v":0},{"$f":"Account!$AB$2","v":0},{"$f":"Usage!$X197","v":0},{"$f":"Usage!$W197","v":0},{"$f":"Account!$AA$2","v":0},{"$f":"Usage!$Y197","v":0},{"$f":"Usage!$Z197","v":0},0]
[{"$f":"Tenant!$A198","v":197},{"$f":"Account!$C$2","v":0},{"$f":"Account!$I$2","v":0},{"$f":"Tenant!$B198","v":0},{"$f":"Tenant!$C198","v":0},{"$f":"Tenant!$D198","v":0},{"$f":"Tenant!$E198","v":0},{"$f":"Tenant!$G198","v":0},{"$f":"Usage!$D198","v":"00:00:00"},{"$f":"Usage!$E198","v":"00:00:00"},{"$f":"Usage!$F198","v":0},{"$f":"Usage!$G198","v":0},{"$f":"Usage!$H198","v":0},{"$f":"Usage!$L198","v":0},{"$f":"Account!$AI$2","v":0},{"$f":"Usage!$N198","v":0},{"$f":"Usage!$M198","v":0},{"$f":"Account!$AH$2","v":0},{"$f":"Usage!$O198","v":0},0,{"$f":"Tenant!$H198","v":0},{"$f":"Account!$Y$2/100","v":0},{"$f":"Usage!$R198","v":0},{"$f":"Account!$X$2/100","v":0},{"$f":"Usage!$S198","v":0},{"$f":"Tenant!$I198","v":0},{"$f":"Usage!$V198","v":0},{"$f":"Account!$AB$2","v":0},{"$f":"Usage!$X198","v":0},{"$f":"Usage!$W198","v":0},{"$f":"Account!$AA$2","v":0},{"$f":"Usage!$Y198","v":0},{"$f":"Usage!$Z198","v":0},0]
[{"$f":"Tenant!$A199","v":198},{"$f":"Account!$C$2","v":0},{"$f":"Account!$I$2","v":0},{"$f":"Tenant!$B199","v":0},{"$f":"Tenant!$C199","v":0},{"$f":"Tenant!$D199","v":0},{"$f":"Tenant!$E199","v":0},{"$f":"Tenant!$G199","v":0},{"$f":"Usage!$D199","v":"00:00:00"},{"$f":"Usage!$E199","v":"00:00:00"},{"$f":"Usage!$F199","v":0},{"$f":"Usage!$G199","v":0},{"$f":"Usage!$H199","v":0},{"$f":"Usage!$L199","v":0},{"$f":"Account!$AI$2","v":0},{"$f":"Usage!$N199","v":0},{"$f":"Usage!$M199","v":0},{"$f":"Account!$AH$2","v":0},{"$f":"Usage!$O199","v":0},0,{"$f":"Tenant!$H199","v":0},{"$f":"Account!$Y$2/100","v":0},{"$f":"Usage!$R199","v":0},{"$f":"Account!$X$2/100","v":0},{"$f":"Usage!$S199","v":0},{"$f":"Tenant!$I199","v":0},{"$f":"Usage!$V199","v":0},{"$f":"Account!$AB$2","v":0},{"$f":"Usage!$X199","v":0},{"$f":"Usage!$W199","v":0},{"$f":"Account!$AA$2","v":0},{"$f":"Usage!$Y199","v":0},{"$f":"Usage!$Z199","v":0},0]
[{"$f":"Tenant!$A200","v":199},{"$f":"Account!$C$2","v":0},{"$f":"Account!$I$2","v":0},{"$f":"Tenant!$B200","v":0},{"$f":"Tenant!$C200","v":0},{"$f":"Tenant!$D200","v":0},{"$f":"Tenant!$E200","v":0},{"$f":"Tenant!$G200","v":0},{"$f":"Usage!$D200","v":"00:00:00"},{"$f":"Usage!$E200","v":"00:00:00"},{"$f":"Usage!$F200","v":0},{"$f":"Usage!$G200","v":0},{"$f":"Usage!$H200","v":0},{"$f":"Usage!$L200","v":0},{"$f":"Account!$AI$2","v":0},{"$f":"Usage!$N200","v":0},{"$f":"Usage!$M200","v":0},{"$f":"Account!$AH$2","v":0},{"$f":"Usage!$O200","v":0},0,{"$f":"Tenant!$H200","v":0},{"$f":"Account!$Y$2/100","v":0},{"$f":"Usage!$R200","v":0},{"$f":"Account!$X$2/100","v":0},{"$f":"Usage!$S200","v":0},{"$f":"Tenant!$I200","v":0},{"$f":"Usage!$V200","v":0},{"$f":"Account!$AB$2","v":0},{"$f":"Usage!$X200","v":0},{"$f":"Usage!$W200","v":0},{"$f":"Account!$AA$2","v":0},{"$f":"Usage!$Y200","v":0},{"$f":"Usage!$Z200","v":0},0]
[{"$f":"Tenant!$A201","v":200},{"$f":"Account!$C$2","v":0},{"$f":"Account!$I$2","v":0},{"$f":"Tenant!$B201","v":0},{"$f":"Tenant!$C201","v":0},{"$f":"Tenant!$D201","v":0},{"$f":"Tenant!$E201","v":0},{"$f":"Tenant!$G201","v":0},{"$f":"Usage!$D201","v":"00:00:00"},{"$f":"Usage!$E201","v":"00:00:00"},{"$f":"Usage!$F201","v":0},{"$f":"Usage!$G201","v":0},{"$f":"Usage!$H201","v":0},{"$f":"Usage!$L201","v":0},{"$f":"Account!$AI$2","v":0},{"$f":"Usage!$N201","v":0},{"$f":"Usage!$M201","v":0},{"$f":"Account!$AH$2","v":0},{"$f":"Usage!$O201","v":0},0,{"$f":"Tenant!$H201","v":0},{"$f":"Account!$Y$2/100","v":0},{"$f":"Usage!$R201","v":0},{"$f":"Account!$X$2/100","v":0},{"$f":"Usage!$S201","v":0},{"$f":"Tenant!$I201","v":0},{"$f":"Usage!$V201","v":0},{"$f":"Account!$AB$2","v":0},{"$f":"Usage!$X201","v":0},{"$f":"Usage!$W201","v":0},{"$f":"Account!$AA$2","v":0},{"$f":"Usage!$Y201","v":0},{"$f":"Usage!$Z201","v":0},0]
[{"$f":"Tenant!$A202","v":201},{"$f":"Account!$C$2","v":0},{"$f":"Account!$I$2","v":0},{"$f":"Tenant!$B202","v":0},{"$f":"Tenant!$C202","v":0},{"$f":"Tenant!$D202","v":0},{"$f":"Tenant!$E202","v":0},{"$f":"Tenant!$G202","v":0},{"$f":"Usage!$D202","v":"00:00:00"},{"$f":"Usage!$E202","v":"00:00:00"},{"$f":"Usage!$F202","v":0},{"$f":"Usage!$G202","v":0},{"$f":"Usage!$H202","v":0},{"$f":"Usage!$L202","v":0},{"$f":"Account!$AI$2","v":0},{"$f":"Usage!$N202","v":0},{"$f":"Usage!$M202","v":0},{"$f":"Account!$AH$2","v":0},{"$f":"Usage!$O202","v":0},0,{"$f":"Tenant!$H202","v":0},{"$f":"Account!$Y$2/100","v":0},{"$f":"Usage!$R202","v":0},{"$f":"Account!$X$2/100","v":0},{"$f":"Usage!$S202","v":0},{"$f":"Tenant!$I202","v":0},{"$f":"Usage!$V202","v":0},{"$f":"Account!$AB$2","v":0},{"$f":"Usage!$X202","v":0},{"$f":"Usage!$W202","v":0},{"$f":"Account!$AA$2","v":0},{"$f":"Usage!$Y202","v":0},{"$f":"Usage!$Z202","v":0},0]
[{"$f":"Tenant!$A203","v":202},{"$f":"Account!$C$2","v":0},{"$f":"Account!$I$2","v":0},{"$f":"Tenant!$B203","v":0},{"$f":"Tenant!$C203","v":0},{"$f":"Tenant!$D203","v":0},{"$f":"Tenant!$E203","v":0},{"$f":"Tenant!$G203","v":0},{"$f":"Usage!$D203","v":"00:00:00"},{"$f":"Usage!$E203","v":"00:00:00"},{"$f":"Usage!$F203","v":0},{"$f":"Usage!$G203","v":0},{"$f":"Usage!$H203","v":0},{"$f":"Usage!$L203","v":0},{"$f":"Account!$AI$2","v":0},{"$f":"Usage!$N203","v":0},{"$f":"Usage!$M203","v":0},{"$f":"Account!$AH$2","v":0},{"$f":"Usage!$O203","v":0},0,{"$f":"Tenant!$H203","v":0},{"$f":"Account!$Y$2/100","v":0},{"$f":"Usage!$R203","v":0},{"$f":"Account!$X$2/100","v":0},{"$f":"Usage!$S203","v":0},{"$f":"Tenant!$I203","v":0},{"$f":"Usage!$V203","v":0},{"$f":"Account!$AB$2","v":0},{"$f":"Usage!$X203","v":0},{"$f":"Usage!$W203","v":0},{"$f":"Account!$AA$2","v":0},{"$f":"Usage!$Y203","v":0},{"$f":"Usage!$Z203","v":0},0]
[{"$f":"Tenant!$A204","v":203},{"$f":"Account!$C$2","v":0},{"$f":"Account!$I$2","v":0},{"$f":"Tenant!$B204","v":0},{"$f":"Tenant!$C204","v":0},{"$f":"Tenant!$D204","v":0},{"$f":"Tenant!$E204","v":0},{"$f":"Tenant!$G204","v":0},{"$f":"Usage!$D204","v":"00:00:00"},{"$f":"Usage!$E204","v":"00:00:00"},{"$f":"Usage!$F204","v":0},{"$f":"Usage!$G204","v":0},{"$f":"Usage!$H204","v":0},{"$f":"Usage!$L204","v":0},{"$f":"Account!$AI$2","v":0},{"$f":"Usage!$N204","v":0},{"$f":"Usage!$M204","v":0},{"$f":"Account!$AH$2","v":0},{"$f":"Usage!$O204","v":0},0,{"$f":"Tenant!$H204","v":0},{"$f":"Account!$Y$2/100","v":0},{"$f":"Usage!$R204","v":0},{"$f":"Account!$X$2/100","v":0},{"$f":"Usage!$S204","v":0},{"$f":"Tenant!$I204","v":0},{"$f":"Usage!$V204","v":0},{"$f":"Account!$AB$2","v":0},{"$f":"Usage!$X204","v":0},{"$f":"Usage!$W204","v":0},{"$f":"Account!$AA$2","v":0},{"$f":"Usage!$Y204","v":0},{"$f":"Usage!$Z204","v":0},0]
[{"$f":"Tenant!$A205","v":204},{"$f":"Account!$C$2","v":0},{"$f":"Account!$I$2","v":0},{"$f":"Tenant!$B205","v":0},{"$f":"Tenant!$C205","v":0},{"$f":"Tenant!$D205","v":0},{"$f":"Tenant!$E205","v":0},{"$f":"Tenant!$G205","v":0},{"$f":"Usage!$D205","v":"00:00:00"},{"$f":"Usage!$E205","v":"00:00:00"},{"$f":"Usage!$F205","v":0},{"$f":"Usage!$G205","v":0},{"$f":"Usage!$H205","v":0},{"$f":"Usage!$L205","v":0},{"$f":"Account!$AI$2","v":0},{"$f":"Usage!$N205","v":0},{"$f":"Usage!$M205","v":0},{"$f":"Account!$AH$2","v":0},{"$f":"Usage!$O205","v":0},0,{"$f":"Tenant!$H205","v":0},{"$f":"Account!$Y$2/100","v":0},{"$f":"Usage!$R205","v":0},{"$f":"Account!$X$2/100","v":0},{"$f":"Usage!$S205","v":0},{"$f":"Tenant!$I205","v":0},{"$f":"Usage!$V205","v":0},{"$f":"Account!$AB$2","v":0},{"$f":"Usage!$X205","v":0},{"$f":"Usage!$W205","v":0},{"$f":"Account!$AA$2","v":0},{"$f":"Usage!$Y205","v":0},{"$f":"Usage!$Z205","v":0},0]
[{"$f":"Tenant!$A206","v":205},{"$f":"Account!$C$2","v":0},{"$f":"Account!$I$2","v":0},{"$f":"Tenant!$B206","v":0},{"$f":"Tenant!$C206","v":0},{"$f":"Tenant!$D206","v":0},{"$f":"Tenant!$E206","v":0},{"$f":"Tenant!$G206","v":0},{"$f":"Usage!$D206","v":"00:00:00"},{"$f":"Usage!$E206","v":"00:00:00"},{"$f":"Usage!$F206","v":0},{"$f":"Usage!$G206","v":0},{"$f":"Usage!$H206","v":0},{"$f":"Usage!$L206","v":0},{"$f":"Account!$AI$2","v":0},{"$f":"Usage!$N206","v":0},{"$f":"Usage!$M206","v":0},{"$f":"Account!$AH$2","v":0},{"$f":"Usage!$O206","v":0},0,{"$f":"Tenant!$H206","v":0},{"$f":"Account!$Y$2/100","v":0},{"$f":"Usage!$R206","v":0},{"$f":"Account!$X$2/100","v":0},{"$f":"Usage!$S206","v":0},{"$f":"Tenant!$I206","v":0},{"$f":"Usage!$V206","v":0},{"$f":"Account!$AB$2","v":0},{"$f":"Usage!$X206","v":0},{"$f":"Usage!$W206","v":0},{"$f":"Account!$AA$2","v":0},{"$f":"Usage!$Y206","v":0},{"$f":"Usage!$Z206","v":0},0]
[{"$f":"Tenant!$A207","v":206},{"$f":"Account!$C$2","v":0},{"$f":"Account!$I$2","v":0},{"$f":"Tenant!$B207","v":0},{"$f":"Tenant!$C207","v":0},{"$f":"Tenant!$D207","v":0},{"$f":"Tenant!$E207","v":0},{"$f":"Tenant!$G207","v":0},{"$f":"Usage!$D207","v":"00:00:00"},{"$f":"Usage!$E207","v":"00:00:00"},{"$f":"Usage!$F207","v":0},{"$f":"Usage!$G207","v":0},{"$f":"Usage!$H207","v":0},{"$f":"Usage!$L207","v":0},{"$f":"Account!$AI$2","v":0},{"$f":"Usage!$N207","v":0},{"$f":"Usage!$M207","v":0},{"$f":"Account!$AH$2","v":0},{"$f":"Usage!$O207","v":0},0,{"$f":"Tenant!$H207","v":0},{"$f":"Account!$Y$2/100","v":0},{"$f":"Usage!$R207","v":0},{"$f":"Account!$X$2/100","v":0},{"$f":"Usage!$S207","v":0},{"$f":"Tenant!$I207","v":0},{"$f":"Usage!$V207","v":0},{"$f":"Account!$AB$2","v":0},{"$f":"Usage!$X207","v":0},{"$f":"Usage!$W207","v":0},{"$f":"Account!$AA$2","v":0},{"$f":"Usage!$Y207","v":0},{"$f":"Usage!$Z207","v":0},0]
[{"$f":"Tenant!$A208","v":207},{"$f":"Account!$C$2","v":0},{"$f":"Account!$I$2","v":0},{"$f":"Tenant!$B208","v":0},{"$f":"Tenant!$C208","v":0},{"$f":"Tenant!$D208","v":0},{"$f":"Tenant!$E208","v":0},{"$f":"Tenant!$G208","v":0},{"$f":"Usage!$D208","v":"00:00:00"},{"$f":"Usage!$E208","v":"00:00:00"},{"$f":"Usage!$F208","v":0},{"$f":"Usage!$G208","v":0},{"$f":"Usage!$H208","v":0},{"$f":"Usage!$L208","v":0},{"$f":"Account!$AI$2","v":0},{"$f":"Usage!$N208","v":0},{"$f":"Usage!$M208","v":0},{"$f":"Account!$AH$2","v":0},{"$f":"Usage!$O208","v":0},0,{"$f":"Tenant!$H208","v":0},{"$f":"Account!$Y$2/100","v":0},{"$f":"Usage!$R208","v":0},{"$f":"Account!$X$2/100","v":0},{"$f":"Usage!$S208","v":0},{"$f":"Tenant!$I208","v":0},{"$f":"Usage!$V208","v":0},{"$f":"Account!$AB$2","v":0},{"$f":"Usage!$X208","v":0},{"$f":"Usage!$W208","v":0},{"$f":"Account!$AA$2","v":0},{"$f":"Usage!$Y208","v":0},{"$f":"Usage!$Z208","v":0},0]
[{"$f":"Tenant!$A209","v":208},{"$f":"Account!$C$2","v":0},{"$f":"Account!$I$2","v":0},{"$f":"Tenant!$B209","v":0},{"$f":"Tenant!$C209","v":0},{"$f":"Tenant!$D209","v":0},{"$f":"Tenant!$E209","v":0},{"$f":"Tenant!$G209","v":0},{"$f":"Usage!$D209","v":"00:00:00"},{"$f":"Usage!$E209","v":"00:00:00"},{"$f":"Usage!$F209","v":0},{"$f":"Usage!$G209","v":0},{"$f":"Usage!$H209","v":0},{"$f":"Usage!$L209","v":0},{"$f":"Account!$AI$2","v":0},{"$f":"Usage!$N209","v":0},{"$f":"Usage!$M209","v":0},{"$f":"Account!$AH$2","v":0},{"$f":"Usage!$O209","v":0},0,{"$f":"Tenant!$H209","v":0},{"$f":"Account!$Y$2/100","v":0},{"$f":"Usage!$R209","v":0},{"$f":"Account!$X$2/100","v":0},{"$f":"Usage!$S209","v":0},{"$f":"Tenant!$I209","v":0},{"$f":"Usage!$V209","v":0},{"$f":"Account!$AB$2","v":0},{"$f":"Usage!$X209","v":0},{"$f":"Usage!$W209","v":0},{"$f":"Account!$AA$2","v":0},{"$f":"Usage!$Y209","v":0},{"$f":"Usage!$Z209","v":0},0]
[{"$f":"Tenant!$A210","v":209},{"$f":"Account!$C$2","v":0},{"$f":"Account!$I$2","v":0},{"$f":"Tenant!$B210","v":0},{"$f":"Tenant!$C210","v":0},{"$f":"Tenant!$D210","v":0},{"$f":"Tenant!$E210","v":0},{"$f":"Tenant!$G210","v":0},{"$f":"Usage!$D210","v":"00:00:00"},{"$f":"Usage!$E210","v":"00:00:00"},{"$f":"Usage!$F210","v":0},{"$f":"Usage!$G210","v":0},{"$f":"Usage!$H210","v":0},{"$f":"Usage!$L210","v":0},{"$f":"Account!$AI$2","v":0},{"$f":"Usage!$N210","v":0},{"$f":"Usage!$M210","v":0},{"$f":"Account!$AH$2","v":0},{"$f":"Usage!$O210","v":0},0,{"$f":"Tenant!$H210","v":0},{"$f":"Account!$Y$2/100","v":0},{"$f":"Usage!$R210","v":0},{"$f":"Account!$X$2/100","v":0},{"$f":"Usage!$S210","v":0},{"$f":"Tenant!$I210","v":0},{"$f":"Usage!$V210","v":0},{"$f":"Account!$AB$2","v":0},{"$f":"Usage!$X210","v":0},{"$f":"Usage!$W210","v":0},{"$f":"Account!$AA$2","v":0},{"$f":"Usage!$Y210","v":0},{"$f":"Usage!$Z210","v":0},0]
[{"$f":"Tenant!$A211","v":210},{"$f":"Account!$C$2","v":0},{"$f":"Account!$I$2","v":0},{"$f":"Tenant!$B211","v":0},{"$f":"Tenant!$C211","v":0},{"$f":"Tenant!$D211","v":0},{"$f":"Tenant!$E211","v":0},{"$f":"Tenant!$G211","v":0},{"$f":"Usage!$D211","v":"00:00:00"},{"$f":"Usage!$E211","v":"00:00:00"},{"$f":"Usage!$F211","v":0},{"$f":"Usage!$G211","v":0},{"$f":"Usage!$H211","v":0},{"$f":"Usage!$L211","v":0},{"$f":"Account!$AI$2","v":0},{"$f":"Usage!$N211","v":0},{"$f":"Usage!$M211","v":0},{"$f":"Account!$AH$2","v":0},{"$f":"Usage!$O211","v":0},0,{"$f":"Tenant!$H211","v":0},{"$f":"Account!$Y$2/100","v":0},{"$f":"Usage!$R211","v":0},{"$f":"Account!$X$2/100","v":0},{"$f":"Usage!$S211","v":0},{"$f":"Tenant!$I211","v":0},{"$f":"Usage!$V211","v":0},{"$f":"Account!$AB$2","v":0},{"$f":"Usage!$X211","v":0},{"$f":"Usage!$W211","v":0},{"$f":"Account!$AA$2","v":0},{"$f":"Usage!$Y211","v":0},{"$f":"Usage!$Z211","v":0},0]
[{"$f":"Tenant!$A212","v":211},{"$f":"Account!$C$2","v":0},{"$f":"Account!$I$2","v":0},{"$f":"Tenant!$B212","v":0},{"$f":"Tenant!$C212","v":0},{"$f":"Tenant!$D212","v":0},{"$f":"Tenant!$E212","v":0},{"$f":"Tenant!$G212","v":0},{"$f":"Usage!$D212","v":"00:00:00"},{"$f":"Usage!$E212","v":"00:00:00"},{"$f":"Usage!$F212","v":0},{"$f":"Usage!$G212","v":0},{"$f":"Usage!$H212","v":0},{"$f":"Usage!$L212","v":0},{"$f":"Account!$AI$2","v":0},{"$f":"Usage!$N212","v":0},{"$f":"Usage!$M212","v":0},{"$f":"Account!$AH$2","v":0},{"$f":"Usage!$O212","v":0},0,{"$f":"Tenant!$H212","v":0},{"$f":"Account!$Y$2/100","v":0},{"$f":"Usage!$R212","v":0},{"$f":"Account!$X$2/100","v":0},{"$f":"Usage!$S212","v":0},{"$f":"Tenant!$I212","v":0},{"$f":"Usage!$V212","v":0},{"$f":"Account!$AB$2","v":0},{"$f":"Usage!$X212","v":0},{"$f":"Usage!$W212","v":0},{"$f":"Account!$AA$2","v":0},{"$f":"Usage!$Y212","v":0},{"$f":"Usage!$Z212","v":0},0]
[{"$f":"Tenant!$A213","v":212},{"$f":"Account!$C$2","v":0},{"$f":"Account!$I$2","v":0},{"$f":"Tenant!$B213","v":0},{"$f":"Tenant!$C213","v":0},{"$f":"Tenant!$D213","v":0},{"$f":"Tenant!$E213","v":0},{"$f":"Tenant!$G213","v":0},{"$f":"Usage!$D213","v":"00:00:00"},{"$f":"Usage!$E213","v":"00:00:00"},{"$f":"Usage!$F213","v":0},{"$f":"Usage!$G213","v":0},{"$f":"Usage!$H213","v":0},{"$f":"Usage!$L213","v":0},{"$f":"Account!$AI$2","v":0},{"$f":"Usage!$N213","v":0},{"$f":"Usage!$M213","v":0},{"$f":"Account!$AH$2","v":0},{"$f":"Usage!$O213","v":0},0,{"$f":"Tenant!$H213","v":0},{"$f":"Account!$Y$2/100","v":0},{"$f":"Usage!$R213","v":0},{"$f":"Account!$X$2/100","v":0},{"$f":"Usage!$S213","v":0},{"$f":"Tenant!$I213","v":0},{"$f":"Usage!$V213","v":0},{"$f":"Account!$AB$2","v":0},{"$f":"Usage!$X213","v":0},{"$f":"Usage!$W213","v":0},{"$f":"Account!$AA$2","v":0},{"$f":"Usage!$Y213","v":0},{"$f":"Usage!$Z213","v":0},0]
[{"$f":"Tenant!$A214","v":213},{"$f":"Account!$C$2","v":0},{"$f":"Account!$I$2","v":0},{"$f":"Tenant!$B214","v":0},{"$f":"Tenant!$C214","v":0},{"$f":"Tenant!$D214","v":0},{"$f":"Tenant!$E214","v":0},{"$f":"Tenant!$G214","v":0},{"$f":"Usage!$D214","v":"00:00:00"},{"$f":"Usage!$E214","v":"00:00:00"},{"$f":"Usage!$F214","v":0},{"$f":"Usage!$G214","v":0},{"$f":"Usage!$H214","v":0},{"$f":"Usage!$L214","v":0},{"$f":"Account!$AI$2","v":0},{"$f":"Usage!$N214","v":0},{"$f":"Usage!$M214","v":0},{"$f":"Account!$AH$2","v":0},{"$f":"Usage!$O214","v":0},0,{"$f":"Tenant!$H214","v":0},{"$f":"Account!$Y$2/100","v":0},{"$f":"Usage!$R214","v":0},{"$f":"Account!$X$2/100","v":0},{"$f":"Usage!$S214","v":0},{"$f":"Tenant!$I214","v":0},{"$f":"Usage!$V214","v":0},{"$f":"Account!$AB$2","v":0},{"$f":"Usage!$X214","v":0},{"$f":"Usage!$W214","v":0},{"$f":"Account!$AA$2","v":0},{"$f":"Usage!$Y214","v":0},{"$f":"Usage!$Z214","v":0},0]
[{"$f":"Tenant!$A215","v":214},{"$f":"Account!$C$2","v":0},{"$f":"Account!$I$2","v":0},{"$f":"Tenant!$B215","v":0},{"$f":"Tenant!$C215","v":0},{"$f":"Tenant!$D215","v":0},{"$f":"Tenant!$E215","v":0},{"$f":"Tenant!$G215","v":0},{"$f":"Usage!$D215","v":"00:00:00"},{"$f":"Usage!$E215","v":"00:00:00"},{"$f":"Usage!$F215","v":0},{"$f":"Usage!$G215","v":0},{"$f":"Usage!$H215","v":0},{"$f":"Usage!$L215","v":0},{"$f":"Account!$AI$2","v":0},{"$f":"Usage!$N215","v":0},{"$f":"Usage!$M215","v":0},{"$f":"Account!$AH$2","v":0},{"$f":"Usage!$O215","v":0},0,{"$f":"Tenant!$H215","v":0},{"$f":"Account!$Y$2/100","v":0},{"$f":"Usage!$R215","v":0},{"$f":"Account!$X$2/100","v":0},{"$f":"Usage!$S215","v":0},{"$f":"Tenant!$I215","v":0},{"$f":"Usage!$V215","v":0},{"$f":"Account!$AB$2","v":0},{"$f":"Usage!$X215","v":0},{"$f":"Usage!$W215","v":0},{"$f":"Account!$AA$2","v":0},{"$f":"Usage!$Y215","v":0},{"$f":"Usage!$Z215","v":0},0]
[{"$f":"Tenant!$A216","v":215},{"$f":"Account!$C$2","v":0},{"$f":"Account!$I$2","v":0},{"$f":"Tenant!$B216","v":0},{"$f":"Tenant!$C216","v":0},{"$f":"Tenant!$D216","v":0},{"$f":"Tenant!$E216","v":0},{"$f":"Tenant!$G216","v":0},{"$f":"Usage!$D216","v":"00:00:00"},{"$f":"Usage!$E216","v":"00:00:00"},{"$f":"Usage!$F216","v":0},{"$f":"Usage!$G216","v":0},{"$f":"Usage!$H216","v":0},{"$f":"Usage!$L216","v":0},{"$f":"Account!$AI$2","v":0},{"$f":"Usage!$N216","v":0},{"$f":"Usage!$M216","v":0},{"$f":"Account!$AH$2","v":0},{"$f":"Usage!$O216","v":0},0,{"$f":"Tenant!$H216","v":0},{"$f":"Account!$Y$2/100","v":0},{"$f":"Usage!$R216","v":0},{"$f":"Account!$X$2/100","v":0},{"$f":"Usage!$S216","v":0},{"$f":"Tenant!$I216","v":0},{"$f":"Usage!$V216","v":0},{"$f":"Account!$AB$2","v":0},{"$f":"Usage!$X216","v":0},{"$f":"Usage!$W216","v":0},{"$f":"Account!$AA$2","v":0},{"$f":"Usage!$Y216","v":0},{"$f":"Usage!$Z216","v":0},0]
[{"$f":"Tenant!$A217","v":216},{"$f":"Account!$C$2","v":0},{"$f":"Account!$I$2","v":0},{"$f":"Tenant!$B217","v":0},{"$f":"Tenant!$C217","v":0},{"$f":"Tenant!$D217","v":0},{"$f":"Tenant!$E217","v":0},{"$f":"Tenant!$G217","v":0},{"$f":"Usage!$D217","v":"00:00:00"},{"$f":"Usage!$E217","v":"00:00:00"},{"$f":"Usage!$F217","v":0},{"$f":"Usage!$G217","v":0},{"$f":"Usage!$H217","v":0},{"$f":"Usage!$L217","v":0},{"$f":"Account!$AI$2","v":0},{"$f":"Usage!$N217","v":0},{"$f":"Usage!$M217","v":0},{"$f":"Account!$AH$2","v":0},{"$f":"Usage!$O217","v":0},0,{"$f":"Tenant!$H217","v":0},{"$f":"Account!$Y$2/100","v":0},{"$f":"Usage!$R217","v":0},{"$f":"Account!$X$2/100","v":0},{"$f":"Usage!$S217","v":0},{"$f":"Tenant!$I217","v":0},{"$f":"Usage!$V217","v":0},{"$f":"Account!$AB$2","v":0},{"$f":"Usage!$X217","v":0},{"$f":"Usage!$W217","v":0},{"$f":"Account!$AA$2","v":0},{"$f":"Usage!$Y217","v":0},{"$f":"Usage!$Z217","v":0},0]
[{"$f":"Tenant!$A218","v":217},{"$f":"Account!$C$2","v":0},{"$f":"Account!$I$2","v":0},{"$f":"Tenant!$B218","v":0},{"$f":"Tenant!$C218","v":0},{"$f":"Tenant!$D218","v":0},{"$f":"Tenant!$E218","v":0},{"$f":"Tenant!$G218","v":0},{"$f":"Usage!$D218","v":"00:00:00"},{"$f":"Usage!$E218","v":"00:00:00"},{"$f":"Usage!$F218","v":0},{"$f":"Usage!$G218","v":0},{"$f":"Usage!$H218","v":0},{"$f":"Usage!$L218","v":0},{"$f":"Account!$AI$2","v":0},{"$f":"Usage!$N218","v":0},{"$f":"Usage!$M218","v":0},{"$f":"Account!$AH$2","v":0},{"$f":"Usage!$O218","v":0},0,{"$f":"Tenant!$H218","v":0},{"$f":"Account!$Y$2/100","v":0},{"$f":"Usage!$R218","v":0},{"$f":"Account!$X$2/100","v":0},{"$f":"Usage!$S218","v":0},{"$f":"Tenant!$I218","v":0},{"$f":"Usage!$V218","v":0},{"$f":"Account!$AB$2","v":0},{"$f":"Usage!$X218","v":0},{"$f":"Usage!$W218","v":0},{"$f":"Account!$AA$2","v":0},{"$f":"Usage!$Y218","v":0},{"$f":"Usage!$Z218","v":0},0]
[{"$f":"Tenant!$A219","v":218},{"$f":"Account!$C$2","v":0},{"$f":"Account!$I$2","v":0},{"$f":"Tenant!$B219","v":0},{"$f":"Tenant!$C219","v":0},{"$f":"Tenant!$D219","v":0},{"$f":"Tenant!$E219","v":0},{"$f":"Tenant!$G219","v":0},{"$f":"Usage!$D219","v":"00:00:00"},{"$f":"Usage!$E219","v":"00:00:00"},{"$f":"Usage!$F219","v":0},{"$f":"Usage!$G219","v":0},{"$f":"Usage!$H219","v":0},{"$f":"Usage!$L219","v":0},{"$f":"Account!$AI$2","v":0},{"$f":"Usage!$N219","v":0},{"$f":"Usage!$M219","v":0},{"$f":"Account!$AH$2","v":0},{"$f":"Usage!$O219","v":0},0,{"$f":"Tenant!$H219","v":0},{"$f":"Account!$Y$2/100","v":0},{"$f":"Usage!$R219","v":0},{"$f":"Account!$X$2/100","v":0},{"$f":"Usage!$S219","v":0},{"$f":"Tenant!$I219","v":0},{"$f":"Usage!$V219","v":0},{"$f":"Account!$AB$2","v":0},{"$f":"Usage!$X219","v":0},{"$f":"Usage!$W219","v":0},{"$f":"Account!$AA$2","v":0},{"$f":"Usage!$Y219","v":0},{"$f":"Usage!$Z219","v":0},0]
[{"$f":"Tenant!$A220","v":219},{"$f":"Account!$C$2","v":0},{"$f":"Account!$I$2","v":0},{"$f":"Tenant!$B220","v":0},{"$f":"Tenant!$C220","v":0},{"$f":"Tenant!$D220","v":0},{"$f":"Tenant!$E220","v":0},{"$f":"Tenant!$G220","v":0},{"$f":"Usage!$D220","v":"00:00:00"},{"$f":"Usage!$E220","v":"00:00:00"},{"$f":"Usage!$F220","v":0},{"$f":"Usage!$G220","v":0},{"$f":"Usage!$H220","v":0},{"$f":"Usage!$L220","v":0},{"$f":"Account!$AI$2","v":0},{"$f":"Usage!$N220","v":0},{"$f":"Usage!$M220","v":0},{"$f":"Account!$AH$2","v":0},{"$f":"Usage!$O220","v":0},0,{"$f":"Tenant!$H220","v":0},{"$f":"Account!$Y$2/100","v":0},{"$f":"Usage!$R220","v":0},{"$f":"Account!$X$2/100","v":0},{"$f":"Usage!$S220","v":0},{"$f":"Tenant!$I220","v":0},{"$f":"Usage!$V220","v":0},{"$f":"Account!$AB$2","v":0},{"$f":"Usage!$X220","v":0},{"$f":"Usage!$W220","v":0},{"$f":"Account!$AA$2","v":0},{"$f":"Usage!$Y220","v":0},{"$f":"Usage!$Z220","v":0},0]
[{"$f":"Tenant!$A221","v":220},{"$f":"Account!$C$2","v":0},{"$f":"Account!$I$2","v":0},{"$f":"Tenant!$B221","v":0},{"$f":"Tenant!$C221","v":0},{"$f":"Tenant!$D221","v":0},{"$f":"Tenant!$E221","v":0},{"$f":"Tenant!$G221","v":0},{"$f":"Usage!$D221","v":"00:00:00"},{"$f":"Usage!$E221","v":"00:00:00"},{"$f":"Usage!$F221","v":0},{"$f":"Usage!$G221","v":0},{"$f":"Usage!$H221","v":0},{"$f":"Usage!$L221","v":0},{"$f":"Account!$AI$2","v":0},{"$f":"Usage!$N221","v":0},{"$f":"Usage!$M221","v":0},{"$f":"Account!$AH$2","v":0},{"$f":"Usage!$O221","v":0},0,{"$f":"Tenant!$H221","v":0},{"$f":"Account!$Y$2/100","v":0},{"$f":"Usage!$R221","v":0},{"$f":"Account!$X$2/100","v":0},{"$f":"Usage!$S221","v":0},{"$f":"Tenant!$I221","v":0},{"$f":"Usage!$V221","v":0},{"$f":"Account!$AB$2","v":0},{"$f":"Usage!$X221","v":0},{"$f":"Usage!$W221","v":0},{"$f":"Account!$AA$2","v":0},{"$f":"Usage!$Y221","v":0},{"$f":"Usage!$Z221","v":0},0]
[{"$f":"Tenant!$A222","v":221},{"$f":"Account!$C$2","v":0},{"$f":"Account!$I$2","v":0},{"$f":"Tenant!$B222","v":0},{"$f":"Tenant!$C222","v":0},{"$f":"Tenant!$D222","v":0},{"$f":"Tenant!$E222","v":0},{"$f":"Tenant!$G222","v":0},{"$f":"Usage!$D222","v":"00:00:00"},{"$f":"Usage!$E222","v":"00:00:00"},{"$f":"Usage!$F222","v":0},{"$f":"Usage!$G222","v":0},{"$f":"Usage!$H222","v":0},{"$f":"Usage!$L222","v":0},{"$f":"Account!$AI$2","v":0},{"$f":"Usage!$N222","v":0},{"$f":"Usage!$M222","v":0},{"$f":"Account!$AH$2","v":0},{"$f":"Usage!$O222","v":0},0,{"$f":"Tenant!$H222","v":0},{"$f":"Account!$Y$2/100","v":0},{"$f":"Usage!$R222","v":0},{"$f":"Account!$X$2/100","v":0},{"$f":"Usage!$S222","v":0},{"$f":"Tenant!$I222","v":0},{"$f":"Usage!$V222","v":0},{"$f":"Account!$AB$2","v":0},{"$f":"Usage!$X222","v":0},{"$f":"Usage!$W222","v":0},{"$f":"Account!$AA$2","v":0},{"$f":"Usage!$Y222","v":0},{"$f":"Usage!$Z222","v":0},0]
[{"$f":"Tenant!$A223","v":222},{"$f":"Account!$C$2","v":0},{"$f":"Account!$I$2","v":0},{"$f":"Tenant!$B223","v":0},{"$f":"Tenant!$C223","v":0},{"$f":"Tenant!$D223","v":0},{"$f":"Tenant!$E223","v":0},{"$f":"Tenant!$G223","v":0},{"$f":"Usage!$D223","v":"00:00:00"},{"$f":"Usage!$E223","v":"00:00:00"},{"$f":"Usage!$F223","v":0},{"$f":"Usage!$G223","v":0},{"$f":"Usage!$H223","v":0},{"$f":"Usage!$L223","v":0},{"$f":"Account!$AI$2","v":0},{"$f":"Usage!$N223","v":0},{"$f":"Usage!$M223","v":0},{"$f":"Account!$AH$2","v":0},{"$f":"Usage!$O223","v":0},0,{"$f":"Tenant!$H223","v":0},{"$f":"Account!$Y$2/100","v":0},{"$f":"Usage!$R223","v":0},{"$f":"Account!$X$2/100","v":0},{"$f":"Usage!$S223","v":0},{"$f":"Tenant!$I223","v":0},{"$f":"Usage!$V223","v":0},{"$f":"Account!$AB$2","v":0},{"$f":"Usage!$X223","v":0},{"$f":"Usage!$W223","v":0},{"$f":"Account!$AA$2","v":0},{"$f":"Usage!$Y223","v":0},{"$f":"Usage!$Z223","v":0},0]
[{"$f":"Tenant!$A224","v":223},{"$f":"Account!$C$2","v":0},{"$f":"Account!$I$2","v":0},{"$f":"Tenant!$B224","v":0},{"$f":"Tenant!$C224","v":0},{"$f":"Tenant!$D224","v":0},{"$f":"Tenant!$E224","v":0},{"$f":"Tenant!$G224","v":0},{"$f":"Usage!$D224","v":"00:00:00"},{"$f":"Usage!$E224","v":"00:00:00"},{"$f":"Usage!$F224","v":0},{"$f":"Usage!$G224","v":0},{"$f":"Usage!$H224","v":0},{"$f":"Usage!$L224","v":0},{"$f":"Account!$AI$2","v":0},{"$f":"Usage!$N224","v":0},{"$f":"Usage!$M224","v":0},{"$f":"Account!$AH$2","v":0},{"$f":"Usage!$O224","v":0},0,{"$f":"Tenant!$H224","v":0},{"$f":"Account!$Y$2/100","v":0},{"$f":"Usage!$R224","v":0},{"$f":"Account!$X$2/100","v":0},{"$f":"Usage!$S224","v":0},{"$f":"Tenant!$I224","v":0},{"$f":"Usage!$V224","v":0},{"$f":"Account!$AB$2","v":0},{"$f":"Usage!$X224","v":0},{"$f":"Usage!$W224","v":0},{"$f":"Account!$AA$2","v":0},{"$f":"Usage!$Y224","v":0},{"$f":"Usage!$Z224","v":0},0]
[{"$f":"Tenant!$A225","v":224},{"$f":"Account!$C$2","v":0},{"$f":"Account!$I$2","v":0},{"$f":"Tenant!$B225","v":0},{"$f":"Tenant!$C225","v":0},{"$f":"Tenant!$D225","v":0},{"$f":"Tenant!$E225","v":0},{"$f":"Tenant!$G225","v":0},{"$f":"Usage!$D225","v":"00:00:00"},{"$f":"Usage!$E225","v":"00:00:00"},{"$f":"Usage!$F225","v":0},{"$f":"Usage!$G225","v":0},{"$f":"Usage!$H225","v":0},{"$f":"Usage!$L225","v":0},{"$f":"Account!$AI$2","v":0},{"$f":"Usage!$N225","v":0},{"$f":"Usage!$M225","v":0},{"$f":"Account!$AH$2","v":0},{"$f":"Usage!$O225","v":0},0,{"$f":"Tenant!$H225","v":0},{"$f":"Account!$Y$2/100","v":0},{"$f":"Usage!$R225","v":0},{"$f":"Account!$X$2/100","v":0},{"$f":"Usage!$S225","v":0},{"$f":"Tenant!$I225","v":0},{"$f":"Usage!$V225","v":0},{"$f":"Account!$AB$2","v":0},{"$f":"Usage!$X225","v":0},{"$f":"Usage!$W225","v":0},{"$f":"Account!$AA$2","v":0},{"$f":"Usage!$Y225","v":0},{"$f":"Usage!$Z225","v":0},0]
[{"$f":"Tenant!$A226","v":225},{"$f":"Account!$C$2","v":0},{"$f":"Account!$I$2","v":0},{"$f":"Tenant!$B226","v":0},{"$f":"Tenant!$C226","v":0},{"$f":"Tenant!$D226","v":0},{"$f":"Tenant!$E226","v":0},{"$f":"Tenant!$G226","v":0},{"$f":"Usage!$D226","v":"00:00:00"},{"$f":"Usage!$E226","v":"00:00:00"},{"$f":"Usage!$F226","v":0},{"$f":"Usage!$G226","v":0},{"$f":"Usage!$H226","v":0},{"$f":"Usage!$L226","v":0},{"$f":"Account!$AI$2","v":0},{"$f":"Usage!$N226","v":0},{"$f":"Usage!$M226","v":0},{"$f":"Account!$AH$2","v":0},{"$f":"Usage!$O226","v":0},0,{"$f":"Tenant!$H226","v":0},{"$f":"Account!$Y$2/100","v":0},{"$f":"Usage!$R226","v":0},{"$f":"Account!$X$2/100","v":0},{"$f":"Usage!$S226","v":0},{"$f":"Tenant!$I226","v":0},{"$f":"Usage!$V226","v":0},{"$f":"Account!$AB$2","v":0},{"$f":"Usage!$X226","v":0},{"$f":"Usage!$W226","v":0},{"$f":"Account!$AA$2","v":0},{"$f":"Usage!$Y226","v":0},{"$f":"Usage!$Z226","v":0},0]
[{"$f":"Tenant!$A227","v":226},{"$f":"Account!$C$2","v":0},{"$f":"Account!$I$2","v":0},{"$f":"Tenant!$B227","v":0},{"$f":"Tenant!$C227","v":0},{"$f":"Tenant!$D227","v":0},{"$f":"Tenant!$E227","v":0},{"$f":"Tenant!$G227","v":0},{"$f":"Usage!$D227","v":"00:00:00"},{"$f":"Usage!$E227","v":"00:00:00"},{"$f":"Usage!$F227","v":0},{"$f":"Usage!$G227","v":0},{"$f":"Usage!$H227","v":0},{"$f":"Usage!$L227","v":0},{"$f":"Account!$AI$2","v":0},{"$f":"Usage!$N227","v":0},{"$f":"Usage!$M227","v":0},{"$f":"Account!$AH$2","v":0},{"$f":"Usage!$O227","v":0},0,{"$f":"Tenant!$H227","v":0},{"$f":"Account!$Y$2/100","v":0},{"$f":"Usage!$R227","v":0},{"$f":"Account!$X$2/100","v":0},{"$f":"Usage!$S227","v":0},{"$f":"Tenant!$I227","v":0},{"$f":"Usage!$V227","v":0},{"$f":"Account!$AB$2","v":0},{"$f":"Usage!$X227","v":0},{"$f":"Usage!$W227","v":0},{"$f":"Account!$AA$2","v":0},{"$f":"Usage!$Y227","v":0},{"$f":"Usage!$Z227","v":0},0]
[{"$f":"Tenant!$A228","v":227},{"$f":"Account!$C$2","v":0},{"$f":"Account!$I$2","v":0},{"$f":"Tenant!$B228","v":0},{"$f":"Tenant!$C228","v":0},{"$f":"Tenant!$D228","v":0},{"$f":"Tenant!$E228","v":0},{"$f":"Tenant!$G228","v":0},{"$f":"Usage!$D228","v":"00:00:00"},{"$f":"Usage!$E228","v":"00:00:00"},{"$f":"Usage!$F228","v":0},{"$f":"Usage!$G228","v":0},{"$f":"Usage!$H228","v":0},{"$f":"Usage!$L228","v":0},{"$f":"Account!$AI$2","v":0},{"$f":"Usage!$N228","v":0},{"$f":"Usage!$M228","v":0},{"$f":"Account!$AH$2","v":0},{"$f":"Usage!$O228","v":0},0,{"$f":"Tenant!$H228","v":0},{"$f":"Account!$Y$2/100","v":0},{"$f":"Usage!$R228","v":0},{"$f":"Account!$X$2/100","v":0},{"$f":"Usage!$S228","v":0},{"$f":"Tenant!$I228","v":0},{"$f":"Usage!$V228","v":0},{"$f":"Account!$AB$2","v":0},{"$f":"Usage!$X228","v":0},{"$f":"Usage!$W228","v":0},{"$f":"Account!$AA$2","v":0},{"$f":"Usage!$Y228","v":0},{"$f":"Usage!$Z228","v":0},0]
[{"$f":"Tenant!$A229","v":228},{"$f":"Account!$C$2","v":0},{"$f":"Account!$I$2","v":0},{"$f":"Tenant!$B229","v":0},{"$f":"Tenant!$C229","v":0},{"$f":"Tenant!$D229","v":0},{"$f":"Tenant!$E229","v":0},{"$f":"Tenant!$G229","v":0},{"$f":"Usage!$D229","v":"00:00:00"},{"$f":"Usage!$E229","v":"00:00:00"},{"$f":"Usage!$F229","v":0},{"$f":"Usage!$G229","v":0},{"$f":"Usage!$H229","v":0},{"$f":"Usage!$L229","v":0},{"$f":"Account!$AI$2","v":0},{"$f":"Usage!$N229","v":0},{"$f":"Usage!$M229","v":0},{"$f":"Account!$AH$2","v":0},{"$f":"Usage!$O229","v":0},0,{"$f":"Tenant!$H229","v":0},{"$f":"Account!$Y$2/100","v":0},{"$f":"Usage!$R229","v":0},{"$f":"Account!$X$2/100","v":0},{"$f":"Usage!$S229","v":0},{"$f":"Tenant!$I229","v":0},{"$f":"Usage!$V229","v":0},{"$f":"Account!$AB$2","v":0},{"$f":"Usage!$X229","v":0},{"$f":"Usage!$W229","v":0},{"$f":"Account!$AA$2","v":0},{"$f":"Usage!$Y229","v":0},{"$f":"Usage!$Z229","v":0},0]
[{"$f":"Tenant!$A230","v":229},{"$f":"Account!$C$2","v":0},{"$f":"Account!$I$2","v":0},{"$f":"Tenant!$B230","v":0},{"$f":"Tenant!$C230","v":0},{"$f":"Tenant!$D230","v":0},{"$f":"Tenant!$E230","v":0},{"$f":"Tenant!$G230","v":0},{"$f":"Usage!$D230","v":"00:00:00"},{"$f":"Usage!$E230","v":"00:00:00"},{"$f":"Usage!$F230","v":0},{"$f":"Usage!$G230","v":0},{"$f":"Usage!$H230","v":0},{"$f":"Usage!$L230","v":0},{"$f":"Account!$AI$2","v":0},{"$f":"Usage!$N230","v":0},{"$f":"Usage!$M230","v":0},{"$f":"Account!$AH$2","v":0},{"$f":"Usage!$O230","v":0},0,{"$f":"Tenant!$H230","v":0},{"$f":"Account!$Y$2/100","v":0},{"$f":"Usage!$R230","v":0},{"$f":"Account!$X$2/100","v":0},{"$f":"Usage!$S230","v":0},{"$f":"Tenant!$I230","v":0},{"$f":"Usage!$V230","v":0},{"$f":"Account!$AB$2","v":0},{"$f":"Usage!$X230","v":0},{"$f":"Usage!$W230","v":0},{"$f":"Account!$AA$2","v":0},{"$f":"Usage!$Y230","v":0},{"$f":"Usage!$Z230","v":0},0]
[{"$f":"Tenant!$A231","v":230},{"$f":"Account!$C$2","v":0},{"$f":"Account!$I$2","v":0},{"$f":"Tenant!$B231","v":0},{"$f":"Tenant!$C231","v":0},{"$f":"Tenant!$D231","v":0},{"$f":"Tenant!$E231","v":0},{"$f":"Tenant!$G231","v":0},{"$f":"Usage!$D231","v":"00:00:00"},{"$f":"Usage!$E231","v":"00:00:00"},{"$f":"Usage!$F231","v":0},{"$f":"Usage!$G231","v":0},{"$f":"Usage!$H231","v":0},{"$f":"Usage!$L231","v":0},{"$f":"Account!$AI$2","v":0},{"$f":"Usage!$N231","v":0},{"$f":"Usage!$M231","v":0},{"$f":"Account!$AH$2","v":0},{"$f":"Usage!$O231","v":0},0,{"$f":"Tenant!$H231","v":0},{"$f":"Account!$Y$2/100","v":0},{"$f":"Usage!$R231","v":0},{"$f":"Account!$X$2/100","v":0},{"$f":"Usage!$S231","v":0},{"$f":"Tenant!$I231","v":0},{"$f":"Usage!$V231","v":0},{"$f":"Account!$AB$2","v":0},{"$f":"Usage!$X231","v":0},{"$f":"Usage!$W231","v":0},{"$f":"Account!$AA$2","v":0},{"$f":"Usage!$Y231","v":0},{"$f":"Usage!$Z231","v":0},0]
[{"$f":"Tenant!$A232","v":231},{"$f":"Account!$C$2","v":0},{"$f":"Account!$I$2","v":0},{"$f":"Tenant!$B232","v":0},{"$f":"Tenant!$C232","v":0},{"$f":"Tenant!$D232","v":0},{"$f":"Tenant!$E232","v":0},{"$f":"Tenant!$G232","v":0},{"$f":"Usage!$D232","v":"00:00:00"},{"$f":"Usage!$E232","v":"00:00:00"},{"$f":"Usage!$F232","v":0},{"$f":"Usage!$G232","v":0},{"$f":"Usage!$H232","v":0},{"$f":"Usage!$L232","v":0},{"$f":"Account!$AI$2","v":0},{"$f":"Usage!$N232","v":0},{"$f":"Usage!$M232","v":0},{"$f":"Account!$AH$2","v":0},{"$f":"Usage!$O232","v":0},0,{"$f":"Tenant!$H232","v":0},{"$f":"Account!$Y$2/100","v":0},{"$f":"Usage!$R232","v":0},{"$f":"Account!$X$2/100","v":0},{"$f":"Usage!$S232","v":0},{"$f":"Tenant!$I232","v":0},{"$f":"Usage!$V232","v":0},{"$f":"Account!$AB$2","v":0},{"$f":"Usage!$X232","v":0},{"$f":"Usage!$W232","v":0},{"$f":"Account!$AA$2","v":0},{"$f":"Usage!$Y232","v":0},{"$f":"Usage!$Z232","v":0},0]
[{"$f":"Tenant!$A233","v":232},{"$f":"Account!$C$2","v":0},{"$f":"Account!$I$2","v":0},{"$f":"Tenant!$B233","v":0},{"$f":"Tenant!$C233","v":0},{"$f":"Tenant!$D233","v":0},{"$f":"Tenant!$E233","v":0},{"$f":"Tenant!$G233","v":0},{"$f":"Usage!$D233","v":"00:00:00"},{"$f":"Usage!$E233","v":"00:00:00"},{"$f":"Usage!$F233","v":0},{"$f":"Usage!$G233","v":0},{"$f":"Usage!$H233","v":0},{"$f":"Usage!$L233","v":0},{"$f":"Account!$AI$2","v":0},{"$f":"Usage!$N233","v":0},{"$f":"Usage!$M233","v":0},{"$f":"Account!$AH$2","v":0},{"$f":"Usage!$O233","v":0},0,{"$f":"Tenant!$H233","v":0},{"$f":"Account!$Y$2/100","v":0},{"$f":"Usage!$R233","v":0},{"$f":"Account!$X$2/100","v":0},{"$f":"Usage!$S233","v":0},{"$f":"Tenant!$I233","v":0},{"$f":"Usage!$V233","v":0},{"$f":"Account!$AB$2","v":0},{"$f":"Usage!$X233","v":0},{"$f":"Usage!$W233","v":0},{"$f":"Account!$AA$2","v":0},{"$f":"Usage!$Y233","v":0},{"$f":"Usage!$Z233","v":0},0]
[{"$f":"Tenant!$A234","v":233},{"$f":"Account!$C$2","v":0},{"$f":"Account!$I$2","v":0},{"$f":"Tenant!$B234","v":0},{"$f":"Tenant!$C234","v":0},{"$f":"Tenant!$D234","v":0},{"$f":"Tenant!$E234","v":0},{"$f":"Tenant!$G234","v":0},{"$f":"Usage!$D234","v":"00:00:00"},{"$f":"Usage!$E234","v":"00:00:00"},{"$f":"Usage!$F234","v":0},{"$f":"Usage!$G234","v":0},{"$f":"Usage!$H234","v":0},{"$f":"Usage!$L234","v":0},{"$f":"Account!$AI$2","v":0},{"$f":"Usage!$N234","v":0},{"$f":"Usage!$M234","v":0},{"$f":"Account!$AH$2","v":0},{"$f":"Usage!$O234","v":0},0,{"$f":"Tenant!$H234","v":0},{"$f":"Account!$Y$2/100","v":0},{"$f":"Usage!$R234","v":0},{"$f":"Account!$X$2/100","v":0},{"$f":"Usage!$S234","v":0},{"$f":"Tenant!$I234","v":0},{"$f":"Usage!$V234","v":0},{"$f":"Account!$AB$2","v":0},{"$f":"Usage!$X234","v":0},{"$f":"Usage!$W234","v":0},{"$f":"Account!$AA$2","v":0},{"$f":"Usage!$Y234","v":0},{"$f":"Usage!$Z234","v":0},0]
[{"$f":"Tenant!$A235","v":234},{"$f":"Account!$C$2","v":0},{"$f":"Account!$I$2","v":0},{"$f":"Tenant!$B235","v":0},{"$f":"Tenant!$C235","v":0},{"$f":"Tenant!$D235","v":0},{"$f":"Tenant!$E235","v":0},{"$f":"Tenant!$G235","v":0},{"$f":"Usage!$D235","v":"00:00:00"},{"$f":"Usage!$E235","v":"00:00:00"},{"$f":"Usage!$F235","v":0},{"$f":"Usage!$G235","v":0},{"$f":"Usage!$H235","v":0},{"$f":"Usage!$L235","v":0},{"$f":"Account!$AI$2","v":0},{"$f":"Usage!$N235","v":0},{"$f":"Usage!$M235","v":0},{"$f":"Account!$AH$2","v":0},{"$f":"Usage!$O235","v":0},0,{"$f":"Tenant!$H235","v":0},{"$f":"Account!$Y$2/100","v":0},{"$f":"Usage!$R235","v":0},{"$f":"Account!$X$2/100","v":0},{"$f":"Usage!$S235","v":0},{"$f":"Tenant!$I235","v":0},{"$f":"Usage!$V235","v":0},{"$f":"Account!$AB$2","v":0},{"$f":"Usage!$X235","v":0},{"$f":"Usage!$W235","v":0},{"$f":"Account!$AA$2","v":0},{"$f":"Usage!$Y235","v":0},{"$f":"Usage!$Z235","v":0},0]
[{"$f":"Tenant!$A236","v":235},{"$f":"Account!$C$2","v":0},{"$f":"Account!$I$2","v":0},{"$f":"Tenant!$B236","v":0},{"$f":"Tenant!$C236","v":0},{"$f":"Tenant!$D236","v":0},{"$f":"Tenant!$E236","v":0},{"$f":"Tenant!$G236","v":0},{"$f":"Usage!$D236","v":"00:00:00"},{"$f":"Usage!$E236","v":"00:00:00"},{"$f":"Usage!$F236","v":0},{"$f":"Usage!$G236","v":0},{"$f":"Usage!$H236","v":0},{"$f":"Usage!$L236","v":0},{"$f":"Account!$AI$2","v":0},{"$f":"Usage!$N236","v":0},{"$f":"Usage!$M236","v":0},{"$f":"Account!$AH$2","v":0},{"$f":"Usage!$O236","v":0},0,{"$f":"Tenant!$H236","v":0},{"$f":"Account!$Y$2/100","v":0},{"$f":"Usage!$R236","v":0},{"$f":"Account!$X$2/100","v":0},{"$f":"Usage!$S236","v":0},{"$f":"Tenant!$I236","v":0},{"$f":"Usage!$V236","v":0},{"$f":"Account!$AB$2","v":0},{"$f":"Usage!$X236","v":0},{"$f":"Usage!$W236","v":0},{"$f":"Account!$AA$2","v":0},{"$f":"Usage!$Y236","v":0},{"$f":"Usage!$Z236","v":0},0]
[{"$f":"Tenant!$A237","v":236},{"$f":"Account!$C$2","v":0},{"$f":"Account!$I$2","v":0},{"$f":"Tenant!$B237","v":0},{"$f":"Tenant!$C237","v":0},{"$f":"Tenant!$D237","v":0},{"$f":"Tenant!$E237","v":0},{"$f":"Tenant!$G237","v":0},{"$f":"Usage!$D237","v":"00:00:00"},{"$f":"Usage!$E237","v":"00:00:00"},{"$f":"Usage!$F237","v":0},{"$f":"Usage!$G237","v":0},{"$f":"Usage!$H237","v":0},{"$f":"Usage!$L237","v":0},{"$f":"Account!$AI$2","v":0},{"$f":"Usage!$N237","v":0},{"$f":"Usage!$M237","v":0},{"$f":"Account!$AH$2","v":0},{"$f":"Usage!$O237","v":0},0,{"$f":"Tenant!$H237","v":0},{"$f":"Account!$Y$2/100","v":0},{"$f":"Usage!$R237","v":0},{"$f":"Account!$X$2/100","v":0},{"$f":"Usage!$S237","v":0},{"$f":"Tenant!$I237","v":0},{"$f":"Usage!$V237","v":0},{"$f":"Account!$AB$2","v":0},{"$f":"Usage!$X237","v":0},{"$f":"Usage!$W237","v":0},{"$f":"Account!$AA$2","v":0},{"$f":"Usage!$Y237","v":0},{"$f":"Usage!$Z237","v":0},0]
[{"$f":"Tenant!$A238","v":237},{"$f":"Account!$C$2","v":0},{"$f":"Account!$I$2","v":0},{"$f":"Tenant!$B238","v":0},{"$f":"Tenant!$C238","v":0},{"$f":"Tenant!$D238","v":0},{"$f":"Tenant!$E238","v":0},{"$f":"Tenant!$G238","v":0},{"$f":"Usage!$D238","v":"00:00:00"},{"$f":"Usage!$E238","v":"00:00:00"},{"$f":"Usage!$F238","v":0},{"$f":"Usage!$G238","v":0},{"$f":"Usage!$H238","v":0},{"$f":"Usage!$L238","v":0},{"$f":"Account!$AI$2","v":0},{"$f":"Usage!$N238","v":0},{"$f":"Usage!$M238","v":0},{"$f":"Account!$AH$2","v":0},{"$f":"Usage!$O238","v":0},0,{"$f":"Tenant!$H238","v":0},{"$f":"Account!$Y$2/100","v":0},{"$f":"Usage!$R238","v":0},{"$f":"Account!$X$2/100","v":0},{"$f":"Usage!$S238","v":0},{"$f":"Tenant!$I238","v":0},{"$f":"Usage!$V238","v":0},{"$f":"Account!$AB$2","v":0},{"$f":"Usage!$X238","v":0},{"$f":"Usage!$W238","v":0},{"$f":"Account!$AA$2","v":0},{"$f":"Usage!$Y238","v":0},{"$f":"Usage!$Z238","v":0},0]
[{"$f":"Tenant!$A239","v":238},{"$f":"Account!$C$2","v":0},{"$f":"Account!$I$2","v":0},{"$f":"Tenant!$B239","v":0},{"$f":"Tenant!$C239","v":0},{"$f":"Tenant!$D239","v":0},{"$f":"Tenant!$E239","v":0},{"$f":"Tenant!$G239","v":0},{"$f":"Usage!$D239","v":"00:00:00"},{"$f":"Usage!$E239","v":"00:00:00"},{"$f":"Usage!$F239","v":0},{"$f":"Usage!$G239","v":0},{"$f":"Usage!$H239","v":0},{"$f":"Usage!$L239","v":0},{"$f":"Account!$AI$2","v":0},{"$f":"Usage!$N239","v":0},{"$f":"Usage!$M239","v":0},{"$f":"Account!$AH$2","v":0},{"$f":"Usage!$O239","v":0},0,{"$f":"Tenant!$H239","v":0},{"$f":"Account!$Y$2/100","v":0},{"$f":"Usage!$R239","v":0},{"$f":"Account!$X$2/100","v":0},{"$f":"Usage!$S239","v":0},{"$f":"Tenant!$I239","v":0},{"$f":"Usage!$V239","v":0},{"$f":"Account!$AB$2","v":0},{"$f":"Usage!$X239","v":0},{"$f":"Usage!$W239","v":0},{"$f":"Account!$AA$2","v":0},{"$f":"Usage!$Y239","v":0},{"$f":"Usage!$Z239","v":0},0]
[{"$f":"Tenant!$A240","v":239},{"$f":"Account!$C$2","v":0},{"$f":"Account!$I$2","v":0},{"$f":"Tenant!$B240","v":0},{"$f":"Tenant!$C240","v":0},{"$f":"Tenant!$D240","v":0},{"$f":"Tenant!$E240","v":0},{"$f":"Tenant!$G240","v":0},{"$f":"Usage!$D240","v":"00:00:00"},{"$f":"Usage!$E240","v":"00:00:00"},{"$f":"Usage!$F240","v":0},{"$f":"Usage!$G240","v":0},{"$f":"Usage!$H240","v":0},{"$f":"Usage!$L240","v":0},{"$f":"Account!$AI$2","v":0},{"$f":"Usage!$N240","v":0},{"$f":"Usage!$M240","v":0},{"$f":"Account!$AH$2","v":0},{"$f":"Usage!$O240","v":0},0,{"$f":"Tenant!$H240","v":0},{"$f":"Account!$Y$2/100","v":0},{"$f":"Usage!$R240","v":0},{"$f":"Account!$X$2/100","v":0},{"$f":"Usage!$S240","v":0},{"$f":"Tenant!$I240","v":0},{"$f":"Usage!$V240","v":0},{"$f":"Account!$AB$2","v":0},{"$f":"Usage!$X240","v":0},{"$f":"Usage!$W240","v":0},{"$f":"Account!$AA$2","v":0},{"$f":"Usage!$Y240","v":0},{"$f":"Usage!$Z240","v":0},0]
[{"$f":"Tenant!$A241","v":240},{"$f":"Account!$C$2","v":0},{"$f":"Account!$I$2","v":0},{"$f":"Tenant!$B241","v":0},{"$f":"Tenant!$C241","v":0},{"$f":"Tenant!$D241","v":0},{"$f":"Tenant!$E241","v":0},{"$f":"Tenant!$G241","v":0},{"$f":"Usage!$D241","v":"00:00:00"},{"$f":"Usage!$E241","v":"00:00:00"},{"$f":"Usage!$F241","v":0},{"$f":"Usage!$G241","v":0},{"$f":"Usage!$H241","v":0},{"$f":"Usage!$L241","v":0},{"$f":"Account!$AI$2","v":0},{"$f":"Usage!$N241","v":0},{"$f":"Usage!$M241","v":0},{"$f":"Account!$AH$2","v":0},{"$f":"Usage!$O241","v":0},0,{"$f":"Tenant!$H241","v":0},{"$f":"Account!$Y$2/100","v":0},{"$f":"Usage!$R241","v":0},{"$f":"Account!$X$2/100","v":0},{"$f":"Usage!$S241","v":0},{"$f":"Tenant!$I241","v":0},{"$f":"Usage!$V241","v":0},{"$f":"Account!$AB$2","v":0},{"$f":"Usage!$X241","v":0},{"$f":"Usage!$W241","v":0},{"$f":"Account!$AA$2","v":0},{"$f":"Usage!$Y241","v":0},{"$f":"Usage!$Z241","v":0},0]
[{"$f":"Tenant!$A242","v":241},{"$f":"Account!$C$2","v":0},{"$f":"Account!$I$2","v":0},{"$f":"Tenant!$B242","v":0},{"$f":"Tenant!$C242","v":0},{"$f":"Tenant!$D242","v":0},{"$f":"Tenant!$E242","v":0},{"$f":"Tenant!$G242","v":0},{"$f":"Usage!$D242","v":"00:00:00"},{"$f":"Usage!$E242","v":"00:00:00"},{"$f":"Usage!$F242","v":0},{"$f":"Usage!$G242","v":0},{"$f":"Usage!$H242","v":0},{"$f":"Usage!$L242","v":0},{"$f":"Account!$AI$2","v":0},{"$f":"Usage!$N242","v":0},{"$f":"Usage!$M242","v":0},{"$f":"Account!$AH$2","v":0},{"$f":"Usage!$O242","v":0},0,{"$f":"Tenant!$H242","v":0},{"$f":"Account!$Y$2/100","v":0},{"$f":"Usage!$R242","v":0},{"$f":"Account!$X$2/100","v":0},{"$f":"Usage!$S242","v":0},{"$f":"Tenant!$I242","v":0},{"$f":"Usage!$V242","v":0},{"$f":"Account!$AB$2","v":0},{"$f":"Usage!$X242","v":0},{"$f":"Usage!$W242","v":0},{"$f":"Account!$AA$2","v":0},{"$f":"Usage!$Y242","v":0},{"$f":"Usage!$Z242","v":0},0]
[{"$f":"Tenant!$A243","v":242},{"$f":"Account!$C$2","v":0},{"$f":"Account!$I$2","v":0},{"$f":"Tenant!$B243","v":0},{"$f":"Tenant!$C243","v":0},{"$f":"Tenant!$D243","v":0},{"$f":"Tenant!$E243","v":0},{"$f":"Tenant!$G243","v":0},{"$f":"Usage!$D243","v":"00:00:00"},{"$f":"Usage!$E243","v":"00:00:00"},{"$f":"Usage!$F243","v":0},{"$f":"Usage!$G243","v":0},{"$f":"Usage!$H243","v":0},{"$f":"Usage!$L243","v":0},{"$f":"Account!$AI$2","v":0},{"$f":"Usage!$N243","v":0},{"$f":"Usage!$M243","v":0},{"$f":"Account!$AH$2","v":0},{"$f":"Usage!$O243","v":0},0,{"$f":"Tenant!$H243","v":0},{"$f":"Account!$Y$2/100","v":0},{"$f":"Usage!$R243","v":0},{"$f":"Account!$X$2/100","v":0},{"$f":"Usage!$S243","v":0},{"$f":"Tenant!$I243","v":0},{"$f":"Usage!$V243","v":0},{"$f":"Account!$AB$2","v":0},{"$f":"Usage!$X243","v":0},{"$f":"Usage!$W243","v":0},{"$f":"Account!$AA$2","v":0},{"$f":"Usage!$Y243","v":0},{"$f":"Usage!$Z243","v":0},0]
[{"$f":"Tenant!$A244","v":243},{"$f":"Account!$C$2","v":0},{"$f":"Account!$I$2","v":0},{"$f":"Tenant!$B244","v":0},{"$f":"Tenant!$C244","v":0},{"$f":"Tenant!$D244","v":0},{"$f":"Tenant!$E244","v":0},{"$f":"Tenant!$G244","v":0},{"$f":"Usage!$D244","v":"00:00:00"},{"$f":"Usage!$E244","v":"00:00:00"},{"$f":"Usage!$F244","v":0},{"$f":"Usage!$G244","v":0},{"$f":"Usage!$H244","v":0},{"$f":"Usage!$L244","v":0},{"$f":"Account!$AI$2","v":0},{"$f":"Usage!$N244","v":0},{"$f":"Usage!$M244","v":0},{"$f":"Account!$AH$2","v":0},{"$f":"Usage!$O244","v":0},0,{"$f":"Tenant!$H244","v":0},{"$f":"Account!$Y$2/100","v":0},{"$f":"Usage!$R244","v":0},{"$f":"Account!$X$2/100","v":0},{"$f":"Usage!$S244","v":0},{"$f":"Tenant!$I244","v":0},{"$f":"Usage!$V244","v":0},{"$f":"Account!$AB$2","v":0},{"$f":"Usage!$X244","v":0},{"$f":"Usage!$W244","v":0},{"$f":"Account!$AA$2","v":0},{"$f":"Usage!$Y244","v":0},{"$f":"Usage!$Z244","v":0},0]
[{"$f":"Tenant!$A245","v":244},{"$f":"Account!$C$2","v":0},{"$f":"Account!$I$2","v":0},{"$f":"Tenant!$B245","v":0},{"$f":"Tenant!$C245","v":0},{"$f":"Tenant!$D245","v":0},{"$f":"Tenant!$E245","v":0},{"$f":"Tenant!$G245","v":0},{"$f":"Usage!$D245","v":"00:00:00"},{"$f":"Usage!$E245","v":"00:00:00"},{"$f":"Usage!$F245","v":0},{"$f":"Usage!$G245","v":0},{"$f":"Usage!$H245","v":0},{"$f":"Usage!$L245","v":0},{"$f":"Account!$AI$2","v":0},{"$f":"Usage!$N245","v":0},{"$f":"Usage!$M245","v":0},{"$f":"Account!$AH$2","v":0},{"$f":"Usage!$O245","v":0},0,{"$f":"Tenant!$H245","v":0},{"$f":"Account!$Y$2/100","v":0},{"$f":"Usage!$R245","v":0},{"$f":"Account!$X$2/100","v":0},{"$f":"Usage!$S245","v":0},{"$f":"Tenant!$I245","v":0},{"$f":"Usage!$V245","v":0},{"$f":"Account!$AB$2","v":0},{"$f":"Usage!$X245","v":0},{"$f":"Usage!$W245","v":0},{"$f":"Account!$AA$2","v":0},{"$f":"Usage!$Y245","v":0},{"$f":"Usage!$Z245","v":0},0]
[{"$f":"Tenant!$A246","v":245},{"$f":"Account!$C$2","v":0},{"$f":"Account!$I$2","v":0},{"$f":"Tenant!$B246","v":0},{"$f":"Tenant!$C246","v":0},{"$f":"Tenant!$D246","v":0},{"$f":"Tenant!$E246","v":0},{"$f":"Tenant!$G246","v":0},{"$f":"Usage!$D246","v":"00:00:00"},{"$f":"Usage!$E246","v":"00:00:00"},{"$f":"Usage!$F246","v":0},{"$f":"Usage!$G246","v":0},{"$f":"Usage!$H246","v":0},{"$f":"Usage!$L246","v":0},{"$f":"Account!$AI$2","v":0},{"$f":"Usage!$N246","v":0},{"$f":"Usage!$M246","v":0},{"$f":"Account!$AH$2","v":0},{"$f":"Usage!$O246","v":0},0,{"$f":"Tenant!$H246","v":0},{"$f":"Account!$Y$2/100","v":0},{"$f":"Usage!$R246","v":0},{"$f":"Account!$X$2/100","v":0},{"$f":"Usage!$S246","v":0},{"$f":"Tenant!$I246","v":0},{"$f":"Usage!$V246","v":0},{"$f":"Account!$AB$2","v":0},{"$f":"Usage!$X246","v":0},{"$f":"Usage!$W246","v":0},{"$f":"Account!$AA$2","v":0},{"$f":"Usage!$Y246","v":0},{"$f":"Usage!$Z246","v":0},0]
[{"$f":"Tenant!$A247","v":246},{"$f":"Account!$C$2","v":0},{"$f":"Account!$I$2","v":0},{"$f":"Tenant!$B247","v":0},{"$f":"Tenant!$C247","v":0},{"$f":"Tenant!$D247","v":0},{"$f":"Tenant!$E247","v":0},{"$f":"Tenant!$G247","v":0},{"$f":"Usage!$D247","v":"00:00:00"},{"$f":"Usage!$E247","v":"00:00:00"},{"$f":"Usage!$F247","v":0},{"$f":"Usage!$G247","v":0},{"$f":"Usage!$H247","v":0},{"$f":"Usage!$L247","v":0},{"$f":"Account!$AI$2","v":0},{"$f":"Usage!$N247","v":0},{"$f":"Usage!$M247","v":0},{"$f":"Account!$AH$2","v":0},{"$f":"Usage!$O247","v":0},0,{"$f":"Tenant!$H247","v":0},{"$f":"Account!$Y$2/100","v":0},{"$f":"Usage!$R247","v":0},{"$f":"Account!$X$2/100","v":0},{"$f":"Usage!$S247","v":0},{"$f":"Tenant!$I247","v":0},{"$f":"Usage!$V247","v":0},{"$f":"Account!$AB$2","v":0},{"$f":"Usage!$X247","v":0},{"$f":"Usage!$W247","v":0},{"$f":"Account!$AA$2","v":0},{"$f":"Usage!$Y247","v":0},{"$f":"Usage!$Z247","v":0},0]
[{"$f":"Tenant!$A248","v":247},{"$f":"Account!$C$2","v":0},{"$f":"Account!$I$2","v":0},{"$f":"Tenant!$B248","v":0},{"$f":"Tenant!$C248","v":0},{"$f":"Tenant!$D248","v":0},{"$f":"Tenant!$E248","v":0},{"$f":"Tenant!$G248","v":0},{"$f":"Usage!$D248","v":"00:00:00"},{"$f":"Usage!$E248","v":"00:00:00"},{"$f":"Usage!$F248","v":0},{"$f":"Usage!$G248","v":0},{"$f":"Usage!$H248","v":0},{"$f":"Usage!$L248","v":0},{"$f":"Account!$AI$2","v":0},{"$f":"Usage!$N248","v":0},{"$f":"Usage!$M248","v":0},{"$f":"Account!$AH$2","v":0},{"$f":"Usage!$O248","v":0},0,{"$f":"Tenant!$H248","v":0},{"$f":"Account!$Y$2/100","v":0},{"$f":"Usage!$R248","v":0},{"$f":"Account!$X$2/100","v":0},{"$f":"Usage!$S248","v":0},{"$f":"Tenant!$I248","v":0},{"$f":"Usage!$V248","v":0},{"$f":"Account!$AB$2","v":0},{"$f":"Usage!$X248","v":0},{"$f":"Usage!$W248","v":0},{"$f":"Account!$AA$2","v":0},{"$f":"Usage!$Y248","v":0},{"$f":"Usage!$Z248","v":0},0]
[{"$f":"Tenant!$A249","v":248},{"$f":"Account!$C$2","v":0},{"$f":"Account!$I$2","v":0},{"$f":"Tenant!$B249","v":0},{"$f":"Tenant!$C249","v":0},{"$f":"Tenant!$D249","v":0},{"$f":"Tenant!$E249","v":0},{"$f":"Tenant!$G249","v":0},{"$f":"Usage!$D249","v":"00:00:00"},{"$f":"Usage!$E249","v":"00:00:00"},{"$f":"Usage!$F249","v":0},{"$f":"Usage!$G249","v":0},{"$f":"Usage!$H249","v":0},{"$f":"Usage!$L249","v":0},{"$f":"Account!$AI$2","v":0},{"$f":"Usage!$N249","v":0},{"$f":"Usage!$M249","v":0},{"$f":"Account!$AH$2","v":0},{"$f":"Usage!$O249","v":0},0,{"$f":"Tenant!$H249","v":0},{"$f":"Account!$Y$2/100","v":0},{"$f":"Usage!$R249","v":0},{"$f":"Account!$X$2/100","v":0},{"$f":"Usage!$S249","v":0},{"$f":"Tenant!$I249","v":0},{"$f":"Usage!$V249","v":0},{"$f":"Account!$AB$2","v":0},{"$f":"Usage!$X249","v":0},{"$f":"Usage!$W249","v":0},{"$f":"Account!$AA$2","v":0},{"$f":"Usage!$Y249","v":0},{"$f":"Usage!$Z249","v":0},0]
[{"$f":"Tenant!$A250","v":249},{"$f":"Account!$C$2","v":0},{"$f":"Account!$I$2","v":0},{"$f":"Tenant!$B250","v":0},{"$f":"Tenant!$C250","v":0},{"$f":"Tenant!$D250","v":0},{"$f":"Tenant!$E250","v":0},{"$f":"Tenant!$G250","v":0},{"$f":"Usage!$D250","v":"00:00:00"},{"$f":"Usage!$E250","v":"00:00:00"},{"$f":"Usage!$F250","v":0},{"$f":"Usage!$G250","v":0},{"$f":"Usage!$H250","v":0},{"$f":"Usage!$L250","v":0},{"$f":"Account!$AI$2","v":0},{"$f":"Usage!$N250","v":0},{"$f":"Usage!$M250","v":0},{"$f":"Account!$AH$2","v":0},{"$f":"Usage!$O250","v":0},0,{"$f":"Tenant!$H250","v":0},{"$f":"Account!$Y$2/100","v":0},{"$f":"Usage!$R250","v":0},{"$f":"Account!$X$2/100","v":0},{"$f":"Usage!$S250","v":0},{"$f":"Tenant!$I250","v":0},{"$f":"Usage!$V250","v":0},{"$f":"Account!$AB$2","v":0},{"$f":"Usage!$X250","v":0},{"$f":"Usage!$W250","v":0},{"$f":"Account!$AA$2","v":0},{"$f":"Usage!$Y250","v":0},{"$f":"Usage!$Z250","v":0},0]
[{"$f":"Tenant!$A251","v":250},{"$f":"Account!$C$2","v":0},{"$f":"Account!$I$2","v":0},{"$f":"Tenant!$B251","v":0},{"$f":"Tenant!$C251","v":0},{"$f":"Tenant!$D251","v":0},{"$f":"Tenant!$E251","v":0},{"$f":"Tenant!$G251","v":0},{"$f":"Usage!$D251","v":"00:00:00"},{"$f":"Usage!$E251","v":"00:00:00"},{"$f":"Usage!$F251","v":0},{"$f":"Usage!$G251","v":0},{"$f":"Usage!$H251","v":0},{"$f":"Usage!$L251","v":0},{"$f":"Account!$AI$2","v":0},{"$f":"Usage!$N251","v":0},{"$f":"Usage!$M251","v":0},{"$f":"Account!$AH$2","v":0},{"$f":"Usage!$O251","v":0},0,{"$f":"Tenant!$H251","v":0},{"$f":"Account!$Y$2/100","v":0},{"$f":"Usage!$R251","v":0},{"$f":"Account!$X$2/100","v":0},{"$f":"Usage!$S251","v":0},{"$f":"Tenant!$I251","v":0},{"$f":"Usage!$V251","v":0},{"$f":"Account!$AB$2","v":0},{"$f":"Usage!$X251","v":0},{"$f":"Usage!$W251","v":0},{"$f":"Account!$AA$2","v":0},{"$f":"Usage!$Y251","v":0},{"$f":"Usage!$Z251","v":0},0]
[{"$f":"Tenant!$A252","v":251},{"$f":"Account!$C$2","v":0},{"$f":"Account!$I$2","v":0},{"$f":"Tenant!$B252","v":0},{"$f":"Tenant!$C252","v":0},{"$f":"Tenant!$D252","v":0},{"$f":"Tenant!$E252","v":0},{"$f":"Tenant!$G252","v":0},{"$f":"Usage!$D252","v":"00:00:00"},{"$f":"Usage!$E252","v":"00:00:00"},{"$f":"Usage!$F252","v":0},{"$f":"Usage!$G252","v":0},{"$f":"Usage!$H252","v":0},{"$f":"Usage!$L252","v":0},{"$f":"Account!$AI$2","v":0},{"$f":"Usage!$N252","v":0},{"$f":"Usage!$M252","v":0},{"$f":"Account!$AH$2","v":0},{"$f":"Usage!$O252","v":0},0,{"$f":"Tenant!$H252","v":0},{"$f":"Account!$Y$2/100","v":0},{"$f":"Usage!$R252","v":0},{"$f":"Account!$X$2/100","v":0},{"$f":"Usage!$S252","v":0},{"$f":"Tenant!$I252","v":0},{"$f":"Usage!$V252","v":0},{"$f":"Account!$AB$2","v":0},{"$f":"Usage!$X252","v":0},{"$f":"Usage!$W252","v":0},{"$f":"Account!$AA$2","v":0},{"$f":"Usage!$Y252","v":0},{"$f":"Usage!$Z252","v":0},0]
[{"$f":"Tenant!$A253","v":252},{"$f":"Account!$C$2","v":0},{"$f":"Account!$I$2","v":0},{"$f":"Tenant!$B253","v":0},{"$f":"Tenant!$C253","v":0},{"$f":"Tenant!$D253","v":0},{"$f":"Tenant!$E253","v":0},{"$f":"Tenant!$G253","v":0},{"$f":"Usage!$D253","v":"00:00:00"},{"$f":"Usage!$E253","v":"00:00:00"},{"$f":"Usage!$F253","v":0},{"$f":"Usage!$G253","v":0},{"$f":"Usage!$H253","v":0},{"$f":"Usage!$L253","v":0},{"$f":"Account!$AI$2","v":0},{"$f":"Usage!$N253","v":0},{"$f":"Usage!$M253","v":0},{"$f":"Account!$AH$2","v":0},{"$f":"Usage!$O253","v":0},0,{"$f":"Tenant!$H253","v":0},{"$f":"Account!$Y$2/100","v":0},{"$f":"Usage!$R253","v":0},{"$f":"Account!$X$2/100","v":0},{"$f":"Usage!$S253","v":0},{"$f":"Tenant!$I253","v":0},{"$f":"Usage!$V253","v":0},{"$f":"Account!$AB$2","v":0},{"$f":"Usage!$X253","v":0},{"$f":"Usage!$W253","v":0},{"$f":"Account!$AA$2","v":0},{"$f":"Usage!$Y253","v":0},{"$f":"Usage!$Z253","v":0},0]
[{"$f":"Tenant!$A254","v":253},{"$f":"Account!$C$2","v":0},{"$f":"Account!$I$2","v":0},{"$f":"Tenant!$B254","v":0},{"$f":"Tenant!$C254","v":0},{"$f":"Tenant!$D254","v":0},{"$f":"Tenant!$E254","v":0},{"$f":"Tenant!$G254","v":0},{"$f":"Usage!$D254","v":"00:00:00"},{"$f":"Usage!$E254","v":"00:00:00"},{"$f":"Usage!$F254","v":0},{"$f":"Usage!$G254","v":0},{"$f":"Usage!$H254","v":0},{"$f":"Usage!$L254","v":0},{"$f":"Account!$AI$2","v":0},{"$f":"Usage!$N254","v":0},{"$f":"Usage!$M254","v":0},{"$f":"Account!$AH$2","v":0},{"$f":"Usage!$O254","v":0},0,{"$f":"Tenant!$H254","v":0},{"$f":"Account!$Y$2/100","v":0},{"$f":"Usage!$R254","v":0},{"$f":"Account!$X$2/100","v":0},{"$f":"Usage!$S254","v":0},{"$f":"Tenant!$I254","v":0},{"$f":"Usage!$V254","v":0},{"$f":"Account!$AB$2","v":0},{"$f":"Usage!$X254","v":0},{"$f":"Usage!$W254","v":0},{"$f":"Account!$AA$2","v":0},{"$f":"Usage!$Y254","v":0},{"$f":"Usage!$Z254","v":0},0]
[{"$f":"Tenant!$A255","v":254},{"$f":"Account!$C$2","v":0},{"$f":"Account!$I$2","v":0},{"$f":"Tenant!$B255","v":0},{"$f":"Tenant!$C255","v":0},{"$f":"Tenant!$D255","v":0},{"$f":"Tenant!$E255","v":0},{"$f":"Tenant!$G255","v":0},{"$f":"Usage!$D255","v":"00:00:00"},{"$f":"Usage!$E255","v":"00:00:00"},{"$f":"Usage!$F255","v":0},{"$f":"Usage!$G255","v":0},{"$f":"Usage!$H255","v":0},{"$f":"Usage!$L255","v":0},{"$f":"Account!$AI$2","v":0},{"$f":"Usage!$N255","v":0},{"$f":"Usage!$M255","v":0},{"$f":"Account!$AH$2","v":0},{"$f":"Usage!$O255","v":0},0,{"$f":"Tenant!$H255","v":0},{"$f":"Account!$Y$2/100","v":0},{"$f":"Usage!$R255","v":0},{"$f":"Account!$X$2/100","v":0},{"$f":"Usage!$S255","v":0},{"$f":"Tenant!$I255","v":0},{"$f":"Usage!$V255","v":0},{"$f":"Account!$AB$2","v":0},{"$f":"Usage!$X255","v":0},{"$f":"Usage!$W255","v":0},{"$f":"Account!$AA$2","v":0},{"$f":"Usage!$Y255","v":0},{"$f":"Usage!$Z255","v":0},0]
[{"$f":"Tenant!$A256","v":255},{"$f":"Account!$C$2","v":0},{"$f":"Account!$I$2","v":0},{"$f":"Tenant!$B256","v":0},{"$f":"Tenant!$C256","v":0},{"$f":"Tenant!$D256","v":0},{"$f":"Tenant!$E256","v":0},{"$f":"Tenant!$G256","v":0},{"$f":"Usage!$D256","v":"00:00:00"},{"$f":"Usage!$E256","v":"00:00:00"},{"$f":"Usage!$F256","v":0},{"$f":"Usage!$G256","v":0},{"$f":"Usage!$H256","v":0},{"$f":"Usage!$L256","v":0},{"$f":"Account!$AI$2","v":0},{"$f":"Usage!$N256","v":0},{"$f":"Usage!$M256","v":0},{"$f":"Account!$AH$2","v":0},{"$f":"Usage!$O256","v":0},0,{"$f":"Tenant!$H256","v":0},{"$f":"Account!$Y$2/100","v":0},{"$f":"Usage!$R256","v":0},{"$f":"Account!$X$2/100","v":0},{"$f":"Usage!$S256","v":0},{"$f":"Tenant!$I256","v":0},{"$f":"Usage!$V256","v":0},{"$f":"Account!$AB$2","v":0},{"$f":"Usage!$X256","v":0},{"$f":"Usage!$W256","v":0},{"$f":"Account!$AA$2","v":0},{"$f":"Usage!$Y256","v":0},{"$f":"Usage!$Z256","v":0},0]
[{"$f":"Tenant!$A257","v":256},{"$f":"Account!$C$2","v":0},{"$f":"Account!$I$2","v":0},{"$f":"Tenant!$B257","v":0},{"$f":"Tenant!$C257","v":0},{"$f":"Tenant!$D257","v":0},{"$f":"Tenant!$E257","v":0},{"$f":"Tenant!$G257","v":0},{"$f":"Usage!$D257","v":"00:00:00"},{"$f":"Usage!$E257","v":"00:00:00"},{"$f":"Usage!$F257","v":0},{"$f":"Usage!$G257","v":0},{"$f":"Usage!$H257","v":0},{"$f":"Usage!$L257","v":0},{"$f":"Account!$AI$2","v":0},{"$f":"Usage!$N257","v":0},{"$f":"Usage!$M257","v":0},{"$f":"Account!$AH$2","v":0},{"$f":"Usage!$O257","v":0},0,{"$f":"Tenant!$H257","v":0},{"$f":"Account!$Y$2/100","v":0},{"$f":"Usage!$R257","v":0},{"$f":"Account!$X$2/100","v":0},{"$f":"Usage!$S257","v":0},{"$f":"Tenant!$I257","v":0},{"$f":"Usage!$V257","v":0},{"$f":"Account!$AB$2","v":0},{"$f":"Usage!$X257","v":0},{"$f":"Usage!$W257","v":0},{"$f":"Account!$AA$2","v":0},{"$f":"Usage!$Y257","v":0},{"$f":"Usage!$Z257","v":0},0]
[{"$f":"Tenant!$A258","v":257},{"$f":"Account!$C$2","v":0},{"$f":"Account!$I$2","v":0},{"$f":"Tenant!$B258","v":0},{"$f":"Tenant!$C258","v":0},{"$f":"Tenant!$D258","v":0},{"$f":"Tenant!$E258","v":0},{"$f":"Tenant!$G258","v":0},{"$f":"Usage!$D258","v":"00:00:00"},{"$f":"Usage!$E258","v":"00:00:00"},{"$f":"Usage!$F258","v":0},{"$f":"Usage!$G258","v":0},{"$f":"Usage!$H258","v":0},{"$f":"Usage!$L258","v":0},{"$f":"Account!$AI$2","v":0},{"$f":"Usage!$N258","v":0},{"$f":"Usage!$M258","v":0},{"$f":"Account!$AH$2","v":0},{"$f":"Usage!$O258","v":0},0,{"$f":"Tenant!$H258","v":0},{"$f":"Account!$Y$2/100","v":0},{"$f":"Usage!$R258","v":0},{"$f":"Account!$X$2/100","v":0},{"$f":"Usage!$S258","v":0},{"$f":"Tenant!$I258","v":0},{"$f":"Usage!$V258","v":0},{"$f":"Account!$AB$2","v":0},{"$f":"Usage!$X258","v":0},{"$f":"Usage!$W258","v":0},{"$f":"Account!$AA$2","v":0},{"$f":"Usage!$Y258","v":0},{"$f":"Usage!$Z258","v":0},0]
[{"$f":"Tenant!$A259","v":258},{"$f":"Account!$C$2","v":0},{"$f":"Account!$I$2","v":0},{"$f":"Tenant!$B259","v":0},{"$f":"Tenant!$C259","v":0},{"$f":"Tenant!$D259","v":0},{"$f":"Tenant!$E259","v":0},{"$f":"Tenant!$G259","v":0},{"$f":"Usage!$D259","v":"00:00:00"},{"$f":"Usage!$E259","v":"00:00:00"},{"$f":"Usage!$F259","v":0},{"$f":"Usage!$G259","v":0},{"$f":"Usage!$H259","v":0},{"$f":"Usage!$L259","v":0},{"$f":"Account!$AI$2","v":0},{"$f":"Usage!$N259","v":0},{"$f":"Usage!$M259","v":0},{"$f":"Account!$AH$2","v":0},{"$f":"Usage!$O259","v":0},{"$f":"SUM($P259,$S259)","v":0},{"$f":"Tenant!$H259","v":0},{"$f":"Account!$Y$2/100","v":0},{"$f":"Usage!$R259","v":0},{"$f":"Account!$X$2/100","v":0},{"$f":"Usage!$S259","v":0},{"$f":"Tenant!$I259","v":0},{"$f":"Usage!$V259","v":0},{"$f":"Account!$AB$2","v":0},{"$f":"Usage!$X259","v":0},{"$f":"Usage!$W259","v":0},{"$f":"Account!$AA$2","v":0},{"$f":"Usage!$Y259","v":0},{"$f":"Usage!$Z259","v":0},{"$f":"$AG259","v":0}]
[{"$f":"Tenant!$A260","v":259},{"$f":"Account!$C$2","v":0},{"$f":"Account!$I$2","v":0},{"$f":"Tenant!$B260","v":0},{"$f":"Tenant!$C260","v":0},{"$f":"Tenant!$D260","v":0},{"$f":"Tenant!$E260","v":0},{"$f":"Tenant!$G260","v":0},{"$f":"Usage!$D260","v":"00:00:00"},{"$f":"Usage!$E260","v":"00:00:00"},{"$f":"Usage!$F260","v":0},{"$f":"Usage!$G260","v":0},{"$f":"Usage!$H260","v":0},{"$f":"Usage!$L260","v":0},{"$f":"Account!$AI$2","v":0},{"$f":"Usage!$N260","v":0},{"$f":"Usage!$M260","v":0},{"$f":"Account!$AH$2","v":0},{"$f":"Usage!$O260","v":0},0,{"$f":"Tenant!$H260","v":0},{"$f":"Account!$Y$2/100","v":0},{"$f":"Usage!$R260","v":0},{"$f":"Account!$X$2/100","v":0},{"$f":"Usage!$S260","v":0},{"$f":"Tenant!$I260","v":0},{"$f":"Usage!$V260","v":0},{"$f":"Account!$AB$2","v":0},{"$f":"Usage!$X260","v":0},{"$f":"Usage!$W260","v":0},{"$f":"Account!$AA$2","v":0},{"$f":"Usage!$Y260","v":0},{"$f":"Usage!$Z260","v":0},0]
[{"$f":"Tenant!$A261","v":260},{"$f":"Account!$C$2","v":0},{"$f":"Account!$I$2","v":0},{"$f":"Tenant!$B261","v":0},{"$f":"Tenant!$C261","v":0},{"$f":"Tenant!$D261","v":0},{"$f":"Tenant!$E261","v":0},{"$f":"Tenant!$G261","v":0},{"$f":"Usage!$D261","v":"00:00:00"},{"$f":"Usage!$E261","v":"00:00:00"},{"$f":"Usage!$F261","v":0},{"$f":"Usage!$G261","v":0},{"$f":"Usage!$H261","v":0},{"$f":"Usage!$L261","v":0},{"$f":"Account!$AI$2","v":0},{"$f":"Usage!$N261","v":0},{"$f":"Usage!$M261","v":0},{"$f":"Account!$AH$2","v":0},{"$f":"Usage!$O261","v":0},0,{"$f":"Tenant!$H261","v":0},{"$f":"Account!$Y$2/100","v":0},{"$f":"Usage!$R261","v":0},{"$f":"Account!$X$2/100","v":0},{"$f":"Usage!$S261","v":0},{"$f":"Tenant!$I261","v":0},{"$f":"Usage!$V261","v":0},{"$f":"Account!$AB$2","v":0},{"$f":"Usage!$X261","v":0},{"$f":"Usage!$W261","v":0},{"$f":"Account!$AA$2","v":0},{"$f":"Usage!$Y261","v":0},{"$f":"Usage!$Z261","v":0},0]
[{"$f":"Tenant!$A262","v":261},{"$f":"Account!$C$2","v":0},{"$f":"Account!$I$2","v":0},{"$f":"Tenant!$B262","v":0},{"$f":"Tenant!$C262","v":0},{"$f":"Tenant!$D262","v":0},{"$f":"Tenant!$E262","v":0},{"$f":"Tenant!$G262","v":0},{"$f":"Usage!$D262","v":"00:00:00"},{"$f":"Usage!$E262","v":"00:00:00"},{"$f":"Usage!$F262","v":0},{"$f":"Usage!$G262","v":0},{"$f":"Usage!$H262","v":0},{"$f":"Usage!$L262","v":0},{"$f":"Account!$AI$2","v":0},{"$f":"Usage!$N262","v":0},{"$f":"Usage!$M262","v":0},{"$f":"Account!$AH$2","v":0},{"$f":"Usage!$O262","v":0},0,{"$f":"Tenant!$H262","v":0},{"$f":"Account!$Y$2/100","v":0},{"$f":"Usage!$R262","v":0},{"$f":"Account!$X$2/100","v":0},{"$f":"Usage!$S262","v":0},{"$f":"Tenant!$I262","v":0},{"$f":"Usage!$V262","v":0},{"$f":"Account!$AB$2","v":0},{"$f":"Usage!$X262","v":0},{"$f":"Usage!$W262","v":0},{"$f":"Account!$AA$2","v":0},{"$f":"Usage!$Y262","v":0},{"$f":"Usage!$Z262","v":0},0]
[{"$f":"Tenant!$A263","v":262},{"$f":"Account!$C$2","v":0},{"$f":"Account!$I$2","v":0},{"$f":"Tenant!$B263","v":0},{"$f":"Tenant!$C263","v":0},{"$f":"Tenant!$D263","v":0},{"$f":"Tenant!$E263","v":0},{"$f":"Tenant!$G263","v":0},{"$f":"Usage!$D263","v":"00:00:00"},{"$f":"Usage!$E263","v":"00:00:00"},{"$f":"Usage!$F263","v":0},{"$f":"Usage!$G263","v":0},{"$f":"Usage!$H263","v":0},{"$f":"Usage!$L263","v":0},{"$f":"Account!$AI$2","v":0},{"$f":"Usage!$N263","v":0},{"$f":"Usage!$M263","v":0},{"$f":"Account!$AH$2","v":0},{"$f":"Usage!$O263","v":0},0,{"$f":"Tenant!$H263","v":0},{"$f":"Account!$Y$2/100","v":0},{"$f":"Usage!$R263","v":0},{"$f":"Account!$X$2/100","v":0},{"$f":"Usage!$S263","v":0},{"$f":"Tenant!$I263","v":0},{"$f":"Usage!$V263","v":0},{"$f":"Account!$AB$2","v":0},{"$f":"Usage!$X263","v":0},{"$f":"Usage!$W263","v":0},{"$f":"Account!$AA$2","v":0},{"$f":"Usage!$Y263","v":0},{"$f":"Usage!$Z263","v":0},0]
[{"$f":"Tenant!$A264","v":263},{"$f":"Account!$C$2","v":0},{"$f":"Account!$I$2","v":0},{"$f":"Tenant!$B264","v":0},{"$f":"Tenant!$C264","v":0},{"$f":"Tenant!$D264","v":0},{"$f":"Tenant!$E264","v":0},{"$f":"Tenant!$G264","v":0},{"$f":"Usage!$D264","v":"00:00:00"},{"$f":"Usage!$E264","v":"00:00:00"},{"$f":"Usage!$F264","v":0},{"$f":"Usage!$G264","v":0},{"$f":"Usage!$H264","v":0},{"$f":"Usage!$L264","v":0},{"$f":"Account!$AI$2","v":0},{"$f":"Usage!$N264","v":0},{"$f":"Usage!$M264","v":0},{"$f":"Account!$AH$2","v":0},{"$f":"Usage!$O264","v":0},0,{"$f":"Tenant!$H264","v":0},{"$f":"Account!$Y$2/100","v":0},{"$f":"Usage!$R264","v":0},{"$f":"Account!$X$2/100","v":0},{"$f":"Usage!$S264","v":0},{"$f":"Tenant!$I264","v":0},{"$f":"Usage!$V264","v":0},{"$f":"Account!$AB$2","v":0},{"$f":"Usage!$X264","v":0},{"$f":"Usage!$W264","v":0},{"$f":"Account!$AA$2","v":0},{"$f":"Usage!$Y264","v":0},{"$f":"Usage!$Z264","v":0},0]
[{"$f":"Tenant!$A265","v":264},{"$f":"Account!$C$2","v":0},{"$f":"Account!$I$2","v":0},{"$f":"Tenant!$B265","v":0},{"$f":"Tenant!$C265","v":0},{"$f":"Tenant!$D265","v":0},{"$f":"Tenant!$E265","v":0},{"$f":"Tenant!$G265","v":0},{"$f":"Usage!$D265","v":"00:00:00"},{"$f":"Usage!$E265","v":"00:00:00"},{"$f":"Usage!$F265","v":0},{"$f":"Usage!$G265","v":0},{"$f":"Usage!$H265","v":0},{"$f":"Usage!$L265","v":0},{"$f":"Account!$AI$2","v":0},{"$f":"Usage!$N265","v":0},{"$f":"Usage!$M265","v":0},{"$f":"Account!$AH$2","v":0},{"$f":"Usage!$O265","v":0},0,{"$f":"Tenant!$H265","v":0},{"$f":"Account!$Y$2/100","v":0},{"$f":"Usage!$R265","v":0},{"$f":"Account!$X$2/100","v":0},{"$f":"Usage!$S265","v":0},{"$f":"Tenant!$I265","v":0},{"$f":"Usage!$V265","v":0},{"$f":"Account!$AB$2","v":0},{"$f":"Usage!$X265","v":0},{"$f":"Usage!$W265","v":0},{"$f":"Account!$AA$2","v":0},{"$f":"Usage!$Y265","v":0},{"$f":"Usage!$Z265","v":0},0]
[{"$f":"Tenant!$A266","v":265},{"$f":"Account!$C$2","v":0},{"$f":"Account!$I$2","v":0},{"$f":"Tenant!$B266","v":0},{"$f":"Tenant!$C266","v":0},{"$f":"Tenant!$D266","v":0},{"$f":"Tenant!$E266","v":0},{"$f":"Tenant!$G266","v":0},{"$f":"Usage!$D266","v":"00:00:00"},{"$f":"Usage!$E266","v":"00:00:00"},{"$f":"Usage!$F266","v":0},{"$f":"Usage!$G266","v":0},{"$f":"Usage!$H266","v":0},{"$f":"Usage!$L266","v":0},{"$f":"Account!$AI$2","v":0},{"$f":"Usage!$N266","v":0},{"$f":"Usage!$M266","v":0},{"$f":"Account!$AH$2","v":0},{"$f":"Usage!$O266","v":0},0,{"$f":"Tenant!$H266","v":0},{"$f":"Account!$Y$2/100","v":0},{"$f":"Usage!$R266","v":0},{"$f":"Account!$X$2/100","v":0},{"$f":"Usage!$S266","v":0},{"$f":"Tenant!$I266","v":0},{"$f":"Usage!$V266","v":0},{"$f":"Account!$AB$2","v":0},{"$f":"Usage!$X266","v":0},{"$f":"Usage!$W266","v":0},{"$f":"Account!$AA$2","v":0},{"$f":"Usage!$Y266","v":0},{"$f":"Usage!$Z266","v":0},0]
[{"$f":"Tenant!$A267","v":266},{"$f":"Account!$C$2","v":0},{"$f":"Account!$I$2","v":0},{"$f":"Tenant!$B267","v":0},{"$f":"Tenant!$C267","v":0},{"$f":"Tenant!$D267","v":0},{"$f":"Tenant!$E267","v":0},{"$f":"Tenant!$G267","v":0},{"$f":"Usage!$D267","v":"00:00:00"},{"$f":"Usage!$E267","v":"00:00:00"},{"$f":"Usage!$F267","v":0},{"$f":"Usage!$G267","v":0},{"$f":"Usage!$H267","v":0},{"$f":"Usage!$L267","v":0},{"$f":"Account!$AI$2","v":0},{"$f":"Usage!$N267","v":0},{"$f":"Usage!$M267","v":0},{"$f":"Account!$AH$2","v":0},{"$f":"Usage!$O267","v":0},0,{"$f":"Tenant!$H267","v":0},{"$f":"Account!$Y$2/100","v":0},{"$f":"Usage!$R267","v":0},{"$f":"Account!$X$2/100","v":0},{"$f":"Usage!$S267","v":0},{"$f":"Tenant!$I267","v":0},{"$f":"Usage!$V267","v":0},{"$f":"Account!$AB$2","v":0},{"$f":"Usage!$X267","v":0},{"$f":"Usage!$W267","v":0},{"$f":"Account!$AA$2","v":0},{"$f":"Usage!$Y267","v":0},{"$f":"Usage!$Z267","v":0},0]
[{"$f":"Tenant!$A268","v":267},{"$f":"Account!$C$2","v":0},{"$f":"Account!$I$2","v":0},{"$f":"Tenant!$B268","v":0},{"$f":"Tenant!$C268","v":0},{"$f":"Tenant!$D268","v":0},{"$f":"Tenant!$E268","v":0},{"$f":"Tenant!$G268","v":0},{"$f":"Usage!$D268","v":"00:00:00"},{"$f":"Usage!$E268","v":"00:00:00"},{"$f":"Usage!$F268","v":0},{"$f":"Usage!$G268","v":0},{"$f":"Usage!$H268","v":0},{"$f":"Usage!$L268","v":0},{"$f":"Account!$AI$2","v":0},{"$f":"Usage!$N268","v":0},{"$f":"Usage!$M268","v":0},{"$f":"Account!$AH$2","v":0},{"$f":"Usage!$O268","v":0},0,{"$f":"Tenant!$H268","v":0},{"$f":"Account!$Y$2/100","v":0},{"$f":"Usage!$R268","v":0},{"$f":"Account!$X$2/100","v":0},{"$f":"Usage!$S268","v":0},{"$f":"Tenant!$I268","v":0},{"$f":"Usage!$V268","v":0},{"$f":"Account!$AB$2","v":0},{"$f":"Usage!$X268","v":0},{"$f":"Usage!$W268","v":0},{"$f":"Account!$AA$2","v":0},{"$f":"Usage!$Y268","v":0},{"$f":"Usage!$Z268","v":0},0]
[{"$f":"Tenant!$A269","v":268},{"$f":"Account!$C$2","v":0},{"$f":"Account!$I$2","v":0},{"$f":"Tenant!$B269","v":0},{"$f":"Tenant!$C269","v":0},{"$f":"Tenant!$D269","v":0},{"$f":"Tenant!$E269","v":0},{"$f":"Tenant!$G269","v":0},{"$f":"Usage!$D269","v":"00:00:00"},{"$f":"Usage!$E269","v":"00:00:00"},{"$f":"Usage!$F269","v":0},{"$f":"Usage!$G269","v":0},{"$f":"Usage!$H269","v":0},{"$f":"Usage!$L269","v":0},{"$f":"Account!$AI$2","v":0},{"$f":"Usage!$N269","v":0},{"$f":"Usage!$M269","v":0},{"$f":"Account!$AH$2","v":0},{"$f":"Usage!$O269","v":0},0,{"$f":"Tenant!$H269","v":0},{"$f":"Account!$Y$2/100","v":0},{"$f":"Usage!$R269","v":0},{"$f":"Account!$X$2/100","v":0},{"$f":"Usage!$S269","v":0},{"$f":"Tenant!$I269","v":0},{"$f":"Usage!$V269","v":0},{"$f":"Account!$AB$2","v":0},{"$f":"Usage!$X269","v":0},{"$f":"Usage!$W269","v":0},{"$f":"Account!$AA$2","v":0},{"$f":"Usage!$Y269","v":0},{"$f":"Usage!$Z269","v":0},0]
[{"$f":"Tenant!$A270","v":269},{"$f":"Account!$C$2","v":0},{"$f":"Account!$I$2","v":0},{"$f":"Tenant!$B270","v":0},{"$f":"Tenant!$C270","v":0},{"$f":"Tenant!$D270","v":0},{"$f":"Tenant!$E270","v":0},{"$f":"Tenant!$G270","v":0},{"$f":"Usage!$D270","v":"00:00:00"},{"$f":"Usage!$E270","v":"00:00:00"},{"$f":"Usage!$F270","v":0},{"$f":"Usage!$G270","v":0},{"$f":"Usage!$H270","v":0},{"$f":"Usage!$L270","v":0},{"$f":"Account!$AI$2","v":0},{"$f":"Usage!$N270","v":0},{"$f":"Usage!$M270","v":0},{"$f":"Account!$AH$2","v":0},{"$f":"Usage!$O270","v":0},0,{"$f":"Tenant!$H270","v":0},{"$f":"Account!$Y$2/100","v":0},{"$f":"Usage!$R270","v":0},{"$f":"Account!$X$2/100","v":0},{"$f":"Usage!$S270","v":0},{"$f":"Tenant!$I270","v":0},{"$f":"Usage!$V270","v":0},{"$f":"Account!$AB$2","v":0},{"$f":"Usage!$X270","v":0},{"$f":"Usage!$W270","v":0},{"$f":"Account!$AA$2","v":0},{"$f":"Usage!$Y270","v":0},{"$f":"Usage!$Z270","v":0},0]
[{"$f":"Tenant!$A271","v":270},{"$f":"Account!$C$2","v":0},{"$f":"Account!$I$2","v":0},{"$f":"Tenant!$B271","v":0},{"$f":"Tenant!$C271","v":0},{"$f":"Tenant!$D271","v":0},{"$f":"Tenant!$E271","v":0},{"$f":"Tenant!$G271","v":0},{"$f":"Usage!$D271","v":"00:00:00"},{"$f":"Usage!$E271","v":"00:00:00"},{"$f":"Usage!$F271","v":0},{"$f":"Usage!$G271","v":0},{"$f":"Usage!$H271","v":0},{"$f":"Usage!$L271","v":0},{"$f":"Account!$AI$2","v":0},{"$f":"Usage!$N271","v":0},{"$f":"Usage!$M271","v":0},{"$f":"Account!$AH$2","v":0},{"$f":"Usage!$O271","v":0},0,{"$f":"Tenant!$H271","v":0},{"$f":"Account!$Y$2/100","v":0},{"$f":"Usage!$R271","v":0},{"$f":"Account!$X$2/100","v":0},{"$f":"Usage!$S271","v":0},{"$f":"Tenant!$I271","v":0},{"$f":"Usage!$V271","v":0},{"$f":"Account!$AB$2","v":0},{"$f":"Usage!$X271","v":0},{"$f":"Usage!$W271","v":0},{"$f":"Account!$AA$2","v":0},{"$f":"Usage!$Y271","v":0},{"$f":"Usage!$Z271","v":0},0]
[{"$f":"Tenant!$A272","v":271},{"$f":"Account!$C$2","v":0},{"$f":"Account!$I$2","v":0},{"$f":"Tenant!$B272","v":0},{"$f":"Tenant!$C272","v":0},{"$f":"Tenant!$D272","v":0},{"$f":"Tenant!$E272","v":0},{"$f":"Tenant!$G272","v":0},{"$f":"Usage!$D272","v":"00:00:00"},{"$f":"Usage!$E272","v":"00:00:00"},{"$f":"Usage!$F272","v":0},{"$f":"Usage!$G272","v":0},{"$f":"Usage!$H272","v":0},{"$f":"Usage!$L272","v":0},{"$f":"Account!$AI$2","v":0},{"$f":"Usage!$N272","v":0},{"$f":"Usage!$M272","v":0},{"$f":"Account!$AH$2","v":0},{"$f":"Usage!$O272","v":0},0,{"$f":"Tenant!$H272","v":0},{"$f":"Account!$Y$2/100","v":0},{"$f":"Usage!$R272","v":0},{"$f":"Account!$X$2/100","v":0},{"$f":"Usage!$S272","v":0},{"$f":"Tenant!$I272","v":0},{"$f":"Usage!$V272","v":0},{"$f":"Account!$AB$2","v":0},{"$f":"Usage!$X272","v":0},{"$f":"Usage!$W272","v":0},{"$f":"Account!$AA$2","v":0},{"$f":"Usage!$Y272","v":0},{"$f":"Usage!$Z272","v":0},0]
[{"$f":"Tenant!$A273","v":272},{"$f":"Account!$C$2","v":0},{"$f":"Account!$I$2","v":0},{"$f":"Tenant!$B273","v":0},{"$f":"Tenant!$C273","v":0},{"$f":"Tenant!$D273","v":0},{"$f":"Tenant!$E273","v":0},{"$f":"Tenant!$G273","v":0},{"$f":"Usage!$D273","v":"00:00:00"},{"$f":"Usage!$E273","v":"00:00:00"},{"$f":"Usage!$F273","v":0},{"$f":"Usage!$G273","v":0},{"$f":"Usage!$H273","v":0},{"$f":"Usage!$L273","v":0},{"$f":"Account!$AI$2","v":0},{"$f":"Usage!$N273","v":0},{"$f":"Usage!$M273","v":0},{"$f":"Account!$AH$2","v":0},{"$f":"Usage!$O273","v":0},0,{"$f":"Tenant!$H273","v":0},{"$f":"Account!$Y$2/100","v":0},{"$f":"Usage!$R273","v":0},{"$f":"Account!$X$2/100","v":0},{"$f":"Usage!$S273","v":0},{"$f":"Tenant!$I273","v":0},{"$f":"Usage!$V273","v":0},{"$f":"Account!$AB$2","v":0},{"$f":"Usage!$X273","v":0},{"$f":"Usage!$W273","v":0},{"$f":"Account!$AA$2","v":0},{"$f":"Usage!$Y273","v":0},{"$f":"Usage!$Z273","v":0},0]
[{"$f":"Tenant!$A274","v":273},{"$f":"Account!$C$2","v":0},{"$f":"Account!$I$2","v":0},{"$f":"Tenant!$B274","v":0},{"$f":"Tenant!$C274","v":0},{"$f":"Tenant!$D274","v":0},{"$f":"Tenant!$E274","v":0},{"$f":"Tenant!$G274","v":0},{"$f":"Usage!$D274","v":"00:00:00"},{"$f":"Usage!$E274","v":"00:00:00"},{"$f":"Usage!$F274","v":0},{"$f":"Usage!$G274","v":0},{"$f":"Usage!$H274","v":0},{"$f":"Usage!$L274","v":0},{"$f":"Account!$AI$2","v":0},{"$f":"Usage!$N274","v":0},{"$f":"Usage!$M274","v":0},{"$f":"Account!$AH$2","v":0},{"$f":"Usage!$O274","v":0},0,{"$f":"Tenant!$H274","v":0},{"$f":"Account!$Y$2/100","v":0},{"$f":"Usage!$R274","v":0},{"$f":"Account!$X$2/100","v":0},{"$f":"Usage!$S274","v":0},{"$f":"Tenant!$I274","v":0},{"$f":"Usage!$V274","v":0},{"$f":"Account!$AB$2","v":0},{"$f":"Usage!$X274","v":0},{"$f":"Usage!$W274","v":0},{"$f":"Account!$AA$2","v":0},{"$f":"Usage!$Y274","v":0},{"$f":"Usage!$Z274","v":0},0]
[{"$f":"Tenant!$A275","v":274},{"$f":"Account!$C$2","v":0},{"$f":"Account!$I$2","v":0},{"$f":"Tenant!$B275","v":0},{"$f":"Tenant!$C275","v":0},{"$f":"Tenant!$D275","v":0},{"$f":"Tenant!$E275","v":0},{"$f":"Tenant!$G275","v":0},{"$f":"Usage!$D275","v":"00:00:00"},{"$f":"Usage!$E275","v":"00:00:00"},{"$f":"Usage!$F275","v":0},{"$f":"Usage!$G275","v":0},{"$f":"Usage!$H275","v":0},{"$f":"Usage!$L275","v":0},{"$f":"Account!$AI$2","v":0},{"$f":"Usage!$N275","v":0},{"$f":"Usage!$M275","v":0},{"$f":"Account!$AH$2","v":0},{"$f":"Usage!$O275","v":0},0,{"$f":"Tenant!$H275","v":0},{"$f":"Account!$Y$2/100","v":0},{"$f":"Usage!$R275","v":0},{"$f":"Account!$X$2/100","v":0},{"$f":"Usage!$S275","v":0},{"$f":"Tenant!$I275","v":0},{"$f":"Usage!$V275","v":0},{"$f":"Account!$AB$2","v":0},{"$f":"Usage!$X275","v":0},{"$f":"Usage!$W275","v":0},{"$f":"Account!$AA$2","v":0},{"$f":"Usage!$Y275","v":0},{"$f":"Usage!$Z275","v":0},0]
[{"$f":"Tenant!$A276","v":275},{"$f":"Account!$C$2","v":0},{"$f":"Account!$I$2","v":0},{"$f":"Tenant!$B276","v":0},{"$f":"Tenant!$C276","v":0},{"$f":"Tenant!$D276","v":0},{"$f":"Tenant!$E276","v":0},{"$f":"Tenant!$G276","v":0},{"$f":"Usage!$D276","v":"00:00:00"},{"$f":"Usage!$E276","v":"00:00:00"},{"$f":"Usage!$F276","v":0},{"$f":"Usage!$G276","v":0},{"$f":"Usage!$H276","v":0},{"$f":"Usage!$L276","v":0},{"$f":"Account!$AI$2","v":0},{"$f":"Usage!$N276","v":0},{"$f":"Usage!$M276","v":0},{"$f":"Account!$AH$2","v":0},{"$f":"Usage!$O276","v":0},0,{"$f":"Tenant!$H276","v":0},{"$f":"Account!$Y$2/100","v":0},{"$f":"Usage!$R276","v":0},{"$f":"Account!$X$2/100","v":0},{"$f":"Usage!$S276","v":0},{"$f":"Tenant!$I276","v":0},{"$f":"Usage!$V276","v":0},{"$f":"Account!$AB$2","v":0},{"$f":"Usage!$X276","v":0},{"$f":"Usage!$W276","v":0},{"$f":"Account!$AA$2","v":0},{"$f":"Usage!$Y276","v":0},{"$f":"Usage!$Z276","v":0},0]
[{"$f":"Tenant!$A277","v":276},{"$f":"Account!$C$2","v":0},{"$f":"Account!$I$2","v":0},{"$f":"Tenant!$B277","v":0},{"$f":"Tenant!$C277","v":0},{"$f":"Tenant!$D277","v":0},{"$f":"Tenant!$E277","v":0},{"$f":"Tenant!$G277","v":0},{"$f":"Usage!$D277","v":"00:00:00"},{"$f":"Usage!$E277","v":"00:00:00"},{"$f":"Usage!$F277","v":0},{"$f":"Usage!$G277","v":0},{"$f":"Usage!$H277","v":0},{"$f":"Usage!$L277","v":0},{"$f":"Account!$AI$2","v":0},{"$f":"Usage!$N277","v":0},{"$f":"Usage!$M277","v":0},{"$f":"Account!$AH$2","v":0},{"$f":"Usage!$O277","v":0},0,{"$f":"Tenant!$H277","v":0},{"$f":"Account!$Y$2/100","v":0},{"$f":"Usage!$R277","v":0},{"$f":"Account!$X$2/100","v":0},{"$f":"Usage!$S277","v":0},{"$f":"Tenant!$I277","v":0},{"$f":"Usage!$V277","v":0},{"$f":"Account!$AB$2","v":0},{"$f":"Usage!$X277","v":0},{"$f":"Usage!$W277","v":0},{"$f":"Account!$AA$2","v":0},{"$f":"Usage!$Y277","v":0},{"$f":"Usage!$Z277","v":0},0]
[{"$f":"Tenant!$A278","v":277},{"$f":"Account!$C$2","v":0},{"$f":"Account!$I$2","v":0},{"$f":"Tenant!$B278","v":0},{"$f":"Tenant!$C278","v":0},{"$f":"Tenant!$D278","v":0},{"$f":"Tenant!$E278","v":0},{"$f":"Tenant!$G278","v":0},{"$f":"Usage!$D278","v":"00:00:00"},{"$f":"Usage!$E278","v":"00:00:00"},{"$f":"Usage!$F278","v":0},{"$f":"Usage!$G278","v":0},{"$f":"Usage!$H278","v":0},{"$f":"Usage!$L278","v":0},{"$f":"Account!$AI$2","v":0},{"$f":"Usage!$N278","v":0},{"$f":"Usage!$M278","v":0},{"$f":"Account!$AH$2","v":0},{"$f":"Usage!$O278","v":0},0,{"$f":"Tenant!$H278","v":0},{"$f":"Account!$Y$2/100","v":0},{"$f":"Usage!$R278","v":0},{"$f":"Account!$X$2/100","v":0},{"$f":"Usage!$S278","v":0},{"$f":"Tenant!$I278","v":0},{"$f":"Usage!$V278","v":0},{"$f":"Account!$AB$2","v":0},{"$f":"Usage!$X278","v":0},{"$f":"Usage!$W278","v":0},{"$f":"Account!$AA$2","v":0},{"$f":"Usage!$Y278","v":0},{"$f":"Usage!$Z278","v":0},0]
[{"$f":"Tenant!$A279","v":278},{"$f":"Account!$C$2","v":0},{"$f":"Account!$I$2","v":0},{"$f":"Tenant!$B279","v":0},{"$f":"Tenant!$C279","v":0},{"$f":"Tenant!$D279","v":0},{"$f":"Tenant!$E279","v":0},{"$f":"Tenant!$G279","v":0},{"$f":"Usage!$D279","v":"00:00:00"},{"$f":"Usage!$E279","v":"00:00:00"},{"$f":"Usage!$F279","v":0},{"$f":"Usage!$G279","v":0},{"$f":"Usage!$H279","v":0},{"$f":"Usage!$L279","v":0},{"$f":"Account!$AI$2","v":0},{"$f":"Usage!$N279","v":0},{"$f":"Usage!$M279","v":0},{"$f":"Account!$AH$2","v":0},{"$f":"Usage!$O279","v":0},0,{"$f":"Tenant!$H279","v":0},{"$f":"Account!$Y$2/100","v":0},{"$f":"Usage!$R279","v":0},{"$f":"Account!$X$2/100","v":0},{"$f":"Usage!$S279","v":0},{"$f":"Tenant!$I279","v":0},{"$f":"Usage!$V279","v":0},{"$f":"Account!$AB$2","v":0},{"$f":"Usage!$X279","v":0},{"$f":"Usage!$W279","v":0},{"$f":"Account!$AA$2","v":0},{"$f":"Usage!$Y279","v":0},{"$f":"Usage!$Z279","v":0},0]
[{"$f":"Tenant!$A280","v":279},{"$f":"Account!$C$2","v":0},{"$f":"Account!$I$2","v":0},{"$f":"Tenant!$B280","v":0},{"$f":"Tenant!$C280","v":0},{"$f":"Tenant!$D280","v":0},{"$f":"Tenant!$E280","v":0},{"$f":"Tenant!$G280","v":0},{"$f":"Usage!$D280","v":"00:00:00"},{"$f":"Usage!$E280","v":"00:00:00"},{"$f":"Usage!$F280","v":0},{"$f":"Usage!$G280","v":0},{"$f":"Usage!$H280","v":0},{"$f":"Usage!$L280","v":0},{"$f":"Account!$AI$2","v":0},{"$f":"Usage!$N280","v":0},{"$f":"Usage!$M280","v":0},{"$f":"Account!$AH$2","v":0},{"$f":"Usage!$O280","v":0},0,{"$f":"Tenant!$H280","v":0},{"$f":"Account!$Y$2/100","v":0},{"$f":"Usage!$R280","v":0},{"$f":"Account!$X$2/100","v":0},{"$f":"Usage!$S280","v":0},{"$f":"Tenant!$I280","v":0},{"$f":"Usage!$V280","v":0},{"$f":"Account!$AB$2","v":0},{"$f":"Usage!$X280","v":0},{"$f":"Usage!$W280","v":0},{"$f":"Account!$AA$2","v":0},{"$f":"Usage!$Y280","v":0},{"$f":"Usage!$Z280","v":0},0]
[{"$f":"Tenant!$A281","v":280},{"$f":"Account!$C$2","v":0},{"$f":"Account!$I$2","v":0},{"$f":"Tenant!$B281","v":0},{"$f":"Tenant!$C281","v":0},{"$f":"Tenant!$D281","v":0},{"$f":"Tenant!$E281","v":0},{"$f":"Tenant!$G281","v":0},{"$f":"Usage!$D281","v":"00:00:00"},{"$f":"Usage!$E281","v":"00:00:00"},{"$f":"Usage!$F281","v":0},{"$f":"Usage!$G281","v":0},{"$f":"Usage!$H281","v":0},{"$f":"Usage!$L281","v":0},{"$f":"Account!$AI$2","v":0},{"$f":"Usage!$N281","v":0},{"$f":"Usage!$M281","v":0},{"$f":"Account!$AH$2","v":0},{"$f":"Usage!$O281","v":0},0,{"$f":"Tenant!$H281","v":0},{"$f":"Account!$Y$2/100","v":0},{"$f":"Usage!$R281","v":0},{"$f":"Account!$X$2/100","v":0},{"$f":"Usage!$S281","v":0},{"$f":"Tenant!$I281","v":0},{"$f":"Usage!$V281","v":0},{"$f":"Account!$AB$2","v":0},{"$f":"Usage!$X281","v":0},{"$f":"Usage!$W281","v":0},{"$f":"Account!$AA$2","v":0},{"$f":"Usage!$Y281","v":0},{"$f":"Usage!$Z281","v":0},0]
[{"$f":"Tenant!$A282","v":281},{"$f":"Account!$C$2","v":0},{"$f":"Account!$I$2","v":0},{"$f":"Tenant!$B282","v":0},{"$f":"Tenant!$C282","v":0},{"$f":"Tenant!$D282","v":0},{"$f":"Tenant!$E282","v":0},{"$f":"Tenant!$G282","v":0},{"$f":"Usage!$D282","v":"00:00:00"},{"$f":"Usage!$E282","v":"00:00:00"},{"$f":"Usage!$F282","v":0},{"$f":"Usage!$G282","v":0},{"$f":"Usage!$H282","v":0},{"$f":"Usage!$L282","v":0},{"$f":"Account!$AI$2","v":0},{"$f":"Usage!$N282","v":0},{"$f":"Usage!$M282","v":0},{"$f":"Account!$AH$2","v":0},{"$f":"Usage!$O282","v":0},0,{"$f":"Tenant!$H282","v":0},{"$f":"Account!$Y$2/100","v":0},{"$f":"Usage!$R282","v":0},{"$f":"Account!$X$2/100","v":0},{"$f":"Usage!$S282","v":0},{"$f":"Tenant!$I282","v":0},{"$f":"Usage!$V282","v":0},{"$f":"Account!$AB$2","v":0},{"$f":"Usage!$X282","v":0},{"$f":"Usage!$W282","v":0},{"$f":"Account!$AA$2","v":0},{"$f":"Usage!$Y282","v":0},{"$f":"Usage!$Z282","v":0},0]
[{"$f":"Tenant!$A283","v":282},{"$f":"Account!$C$2","v":0},{"$f":"Account!$I$2","v":0},{"$f":"Tenant!$B283","v":0},{"$f":"Tenant!$C283","v":0},{"$f":"Tenant!$D283","v":0},{"$f":"Tenant!$E283","v":0},{"$f":"Tenant!$G283","v":0},{"$f":"Usage!$D283","v":"00:00:00"},{"$f":"Usage!$E283","v":"00:00:00"},{"$f":"Usage!$F283","v":0},{"$f":"Usage!$G283","v":0},{"$f":"Usage!$H283","v":0},{"$f":"Usage!$L283","v":0},{"$f":"Account!$AI$2","v":0},{"$f":"Usage!$N283","v":0},{"$f":"Usage!$M283","v":0},{"$f":"Account!$AH$2","v":0},{"$f":"Usage!$O283","v":0},0,{"$f":"Tenant!$H283","v":0},{"$f":"Account!$Y$2/100","v":0},{"$f":"Usage!$R283","v":0},{"$f":"Account!$X$2/100","v":0},{"$f":"Usage!$S283","v":0},{"$f":"Tenant!$I283","v":0},{"$f":"Usage!$V283","v":0},{"$f":"Account!$AB$2","v":0},{"$f":"Usage!$X283","v":0},{"$f":"Usage!$W283","v":0},{"$f":"Account!$AA$2","v":0},{"$f":"Usage!$Y283","v":0},{"$f":"Usage!$Z283","v":0},0]
[{"$f":"Tenant!$A284","v":283},{"$f":"Account!$C$2","v":0},{"$f":"Account!$I$2","v":0},{"$f":"Tenant!$B284","v":0},{"$f":"Tenant!$C284","v":0},{"$f":"Tenant!$D284","v":0},{"$f":"Tenant!$E284","v":0},{"$f":"Tenant!$G284","v":0},{"$f":"Usage!$D284","v":"00:00:00"},{"$f":"Usage!$E284","v":"00:00:00"},{"$f":"Usage!$F284","v":0},{"$f":"Usage!$G284","v":0},{"$f":"Usage!$H284","v":0},{"$f":"Usage!$L284","v":0},{"$f":"Account!$AI$2","v":0},{"$f":"Usage!$N284","v":0},{"$f":"Usage!$M284","v":0},{"$f":"Account!$AH$2","v":0},{"$f":"Usage!$O284","v":0},0,{"$f":"Tenant!$H284","v":0},{"$f":"Account!$Y$2/100","v":0},{"$f":"Usage!$R284","v":0},{"$f":"Account!$X$2/100","v":0},{"$f":"Usage!$S284","v":0},{"$f":"Tenant!$I284","v":0},{"$f":"Usage!$V284","v":0},{"$f":"Account!$AB$2","v":0},{"$f":"Usage!$X284","v":0},{"$f":"Usage!$W284","v":0},{"$f":"Account!$AA$2","v":0},{"$f":"Usage!$Y284","v":0},{"$f":"Usage!$Z284","v":0},0]
[{"$f":"Tenant!$A285","v":284},{"$f":"Account!$C$2","v":0},{"$f":"Account!$I$2","v":0},{"$f":"Tenant!$B285","v":0},{"$f":"Tenant!$C285","v":0},{"$f":"Tenant!$D285","v":0},{"$f":"Tenant!$E285","v":0},{"$f":"Tenant!$G285","v":0},{"$f":"Usage!$D285","v":"00:00:00"},{"$f":"Usage!$E285","v":"00:00:00"},{"$f":"Usage!$F285","v":0},{"$f":"Usage!$G285","v":0},{"$f":"Usage!$H285","v":0},{"$f":"Usage!$L285","v":0},{"$f":"Account!$AI$2","v":0},{"$f":"Usage!$N285","v":0},{"$f":"Usage!$M285","v":0},{"$f":"Account!$AH$2","v":0},{"$f":"Usage!$O285","v":0},0,{"$f":"Tenant!$H285","v":0},{"$f":"Account!$Y$2/100","v":0},{"$f":"Usage!$R285","v":0},{"$f":"Account!$X$2/100","v":0},{"$f":"Usage!$S285","v":0},{"$f":"Tenant!$I285","v":0},{"$f":"Usage!$V285","v":0},{"$f":"Account!$AB$2","v":0},{"$f":"Usage!$X285","v":0},{"$f":"Usage!$W285","v":0},{"$f":"Account!$AA$2","v":0},{"$f":"Usage!$Y285","v":0},{"$f":"Usage!$Z285","v":0},0]
[{"$f":"Tenant!$A286","v":285},{"$f":"Account!$C$2","v":0},{"$f":"Account!$I$2","v":0},{"$f":"Tenant!$B286","v":0},{"$f":"Tenant!$C286","v":0},{"$f":"Tenant!$D286","v":0},{"$f":"Tenant!$E286","v":0},{"$f":"Tenant!$G286","v":0},{"$f":"Usage!$D286","v":"00:00:00"},{"$f":"Usage!$E286","v":"00:00:00"},{"$f":"Usage!$F286","v":0},{"$f":"Usage!$G286","v":0},{"$f":"Usage!$H286","v":0},{"$f":"Usage!$L286","v":0},{"$f":"Account!$AI$2","v":0},{"$f":"Usage!$N286","v":0},{"$f":"Usage!$M286","v":0},{"$f":"Account!$AH$2","v":0},{"$f":"Usage!$O286","v":0},0,{"$f":"Tenant!$H286","v":0},{"$f":"Account!$Y$2/100","v":0},{"$f":"Usage!$R286","v":0},{"$f":"Account!$X$2/100","v":0},{"$f":"Usage!$S286","v":0},{"$f":"Tenant!$I286","v":0},{"$f":"Usage!$V286","v":0},{"$f":"Account!$AB$2","v":0},{"$f":"Usage!$X286","v":0},{"$f":"Usage!$W286","v":0},{"$f":"Account!$AA$2","v":0},{"$f":"Usage!$Y286","v":0},{"$f":"Usage!$Z286","v":0},0]
[{"$f":"Tenant!$A287","v":286},{"$f":"Account!$C$2","v":0},{"$f":"Account!$I$2","v":0},{"$f":"Tenant!$B287","v":0},{"$f":"Tenant!$C287","v":0},{"$f":"Tenant!$D287","v":0},{"$f":"Tenant!$E287","v":0},{"$f":"Tenant!$G287","v":0},{"$f":"Usage!$D287","v":"00:00:00"},{"$f":"Usage!$E287","v":"00:00:00"},{"$f":"Usage!$F287","v":0},{"$f":"Usage!$G287","v":0},{"$f":"Usage!$H287","v":0},{"$f":"Usage!$L287","v":0},{"$f":"Account!$AI$2","v":0},{"$f":"Usage!$N287","v":0},{"$f":"Usage!$M287","v":0},{"$f":"Account!$AH$2","v":0},{"$f":"Usage!$O287","v":0},0,{"$f":"Tenant!$H287","v":0},{"$f":"Account!$Y$2/100","v":0},{"$f":"Usage!$R287","v":0},{"$f":"Account!$X$2/100","v":0},{"$f":"Usage!$S287","v":0},{"$f":"Tenant!$I287","v":0},{"$f":"Usage!$V287","v":0},{"$f":"Account!$AB$2","v":0},{"$f":"Usage!$X287","v":0},{"$f":"Usage!$W287","v":0},{"$f":"Account!$AA$2","v":0},{"$f":"Usage!$Y287","v":0},{"$f":"Usage!$Z287","v":0},0]
[{"$f":"Tenant!$A288","v":287},{"$f":"Account!$C$2","v":0},{"$f":"Account!$I$2","v":0},{"$f":"Tenant!$B288","v":0},{"$f":"Tenant!$C288","v":0},{"$f":"Tenant!$D288","v":0},{"$f":"Tenant!$E288","v":0},{"$f":"Tenant!$G288","v":0},{"$f":"Usage!$D288","v":"00:00:00"},{"$f":"Usage!$E288","v":"00:00:00"},{"$f":"Usage!$F288","v":0},{"$f":"Usage!$G288","v":0},{"$f":"Usage!$H288","v":0},{"$f":"Usage!$L288","v":0},{"$f":"Account!$AI$2","v":0},{"$f":"Usage!$N288","v":0},{"$f":"Usage!$M288","v":0},{"$f":"Account!$AH$2","v":0},{"$f":"Usage!$O288","v":0},0,{"$f":"Tenant!$H288","v":0},{"$f":"Account!$Y$2/100","v":0},{"$f":"Usage!$R288","v":0},{"$f":"Account!$X$2/100","v":0},{"$f":"Usage!$S288","v":0},{"$f":"Tenant!$I288","v":0},{"$f":"Usage!$V288","v":0},{"$f":"Account!$AB$2","v":0},{"$f":"Usage!$X288","v":0},{"$f":"Usage!$W288","v":0},{"$f":"Account!$AA$2","v":0},{"$f":"Usage!$Y288","v":0},{"$f":"Usage!$Z288","v":0},0]
[{"$f":"Tenant!$A289","v":288},{"$f":"Account!$C$2","v":0},{"$f":"Account!$I$2","v":0},{"$f":"Tenant!$B289","v":0},{"$f":"Tenant!$C289","v":0},{"$f":"Tenant!$D289","v":0},{"$f":"Tenant!$E289","v":0},{"$f":"Tenant!$G289","v":0},{"$f":"Usage!$D289","v":"00:00:00"},{"$f":"Usage!$E289","v":"00:00:00"},{"$f":"Usage!$F289","v":0},{"$f":"Usage!$G289","v":0},{"$f":"Usage!$H289","v":0},{"$f":"Usage!$L289","v":0},{"$f":"Account!$AI$2","v":0},{"$f":"Usage!$N289","v":0},{"$f":"Usage!$M289","v":0},{"$f":"Account!$AH$2","v":0},{"$f":"Usage!$O289","v":0},0,{"$f":"Tenant!$H289","v":0},{"$f":"Account!$Y$2/100","v":0},{"$f":"Usage!$R289","v":0},{"$f":"Account!$X$2/100","v":0},{"$f":"Usage!$S289","v":0},{"$f":"Tenant!$I289","v":0},{"$f":"Usage!$V289","v":0},{"$f":"Account!$AB$2","v":0},{"$f":"Usage!$X289","v":0},{"$f":"Usage!$W289","v":0},{"$f":"Account!$AA$2","v":0},{"$f":"Usage!$Y289","v":0},{"$f":"Usage!$Z289","v":0},0]
[{"$f":"Tenant!$A290","v":289},{"$f":"Account!$C$2","v":0},{"$f":"Account!$I$2","v":0},{"$f":"Tenant!$B290","v":0},{"$f":"Tenant!$C290","v":0},{"$f":"Tenant!$D290","v":0},{"$f":"Tenant!$E290","v":0},{"$f":"Tenant!$G290","v":0},{"$f":"Usage!$D290","v":"00:00:00"},{"$f":"Usage!$E290","v":"00:00:00"},{"$f":"Usage!$F290","v":0},{"$f":"Usage!$G290","v":0},{"$f":"Usage!$H290","v":0},{"$f":"Usage!$L290","v":0},{"$f":"Account!$AI$2","v":0},{"$f":"Usage!$N290","v":0},{"$f":"Usage!$M290","v":0},{"$f":"Account!$AH$2","v":0},{"$f":"Usage!$O290","v":0},0,{"$f":"Tenant!$H290","v":0},{"$f":"Account!$Y$2/100","v":0},{"$f":"Usage!$R290","v":0},{"$f":"Account!$X$2/100","v":0},{"$f":"Usage!$S290","v":0},{"$f":"Tenant!$I290","v":0},{"$f":"Usage!$V290","v":0},{"$f":"Account!$AB$2","v":0},{"$f":"Usage!$X290","v":0},{"$f":"Usage!$W290","v":0},{"$f":"Account!$AA$2","v":0},{"$f":"Usage!$Y290","v":0},{"$f":"Usage!$Z290","v":0},0]
[{"$f":"Tenant!$A291","v":290},{"$f":"Account!$C$2","v":0},{"$f":"Account!$I$2","v":0},{"$f":"Tenant!$B291","v":0},{"$f":"Tenant!$C291","v":0},{"$f":"Tenant!$D291","v":0},{"$f":"Tenant!$E291","v":0},{"$f":"Tenant!$G291","v":0},{"$f":"Usage!$D291","v":"00:00:00"},{"$f":"Usage!$E291","v":"00:00:00"},{"$f":"Usage!$F291","v":0},{"$f":"Usage!$G291","v":0},{"$f":"Usage!$H291","v":0},{"$f":"Usage!$L291","v":0},{"$f":"Account!$AI$2","v":0},{"$f":"Usage!$N291","v":0},{"$f":"Usage!$M291","v":0},{"$f":"Account!$AH$2","v":0},{"$f":"Usage!$O291","v":0},0,{"$f":"Tenant!$H291","v":0},{"$f":"Account!$Y$2/100","v":0},{"$f":"Usage!$R291","v":0},{"$f":"Account!$X$2/100","v":0},{"$f":"Usage!$S291","v":0},{"$f":"Tenant!$I291","v":0},{"$f":"Usage!$V291","v":0},{"$f":"Account!$AB$2","v":0},{"$f":"Usage!$X291","v":0},{"$f":"Usage!$W291","v":0},{"$f":"Account!$AA$2","v":0},{"$f":"Usage!$Y291","v":0},{"$f":"Usage!$Z291","v":0},0]
[{"$f":"Tenant!$A292","v":291},{"$f":"Account!$C$2","v":0},{"$f":"Account!$I$2","v":0},{"$f":"Tenant!$B292","v":0},{"$f":"Tenant!$C292","v":0},{"$f":"Tenant!$D292","v":0},{"$f":"Tenant!$E292","v":0},{"$f":"Tenant!$G292","v":0},{"$f":"Usage!$D292","v":"00:00:00"},{"$f":"Usage!$E292","v":"00:00:00"},{"$f":"Usage!$F292","v":0},{"$f":"Usage!$G292","v":0},{"$f":"Usage!$H292","v":0},{"$f":"Usage!$L292","v":0},{"$f":"Account!$AI$2","v":0},{"$f":"Usage!$N292","v":0},{"$f":"Usage!$M292","v":0},{"$f":"Account!$AH$2","v":0},{"$f":"Usage!$O292","v":0},0,{"$f":"Tenant!$H292","v":0},{"$f":"Account!$Y$2/100","v":0},{"$f":"Usage!$R292","v":0},{"$f":"Account!$X$2/100","v":0},{"$f":"Usage!$S292","v":0},{"$f":"Tenant!$I292","v":0},{"$f":"Usage!$V292","v":0},{"$f":"Account!$AB$2","v":0},{"$f":"Usage!$X292","v":0},{"$f":"Usage!$W292","v":0},{"$f":"Account!$AA$2","v":0},{"$f":"Usage!$Y292","v":0},{"$f":"Usage!$Z292","v":0},0]
[{"$f":"Tenant!$A293","v":292},{"$f":"Account!$C$2","v":0},{"$f":"Account!$I$2","v":0},{"$f":"Tenant!$B293","v":0},{"$f":"Tenant!$C293","v":0},{"$f":"Tenant!$D293","v":0},{"$f":"Tenant!$E293","v":0},{"$f":"Tenant!$G293","v":0},{"$f":"Usage!$D293","v":"00:00:00"},{"$f":"Usage!$E293","v":"00:00:00"},{"$f":"Usage!$F293","v":0},{"$f":"Usage!$G293","v":0},{"$f":"Usage!$H293","v":0},{"$f":"Usage!$L293","v":0},{"$f":"Account!$AI$2","v":0},{"$f":"Usage!$N293","v":0},{"$f":"Usage!$M293","v":0},{"$f":"Account!$AH$2","v":0},{"$f":"Usage!$O293","v":0},0,{"$f":"Tenant!$H293","v":0},{"$f":"Account!$Y$2/100","v":0},{"$f":"Usage!$R293","v":0},{"$f":"Account!$X$2/100","v":0},{"$f":"Usage!$S293","v":0},{"$f":"Tenant!$I293","v":0},{"$f":"Usage!$V293","v":0},{"$f":"Account!$AB$2","v":0},{"$f":"Usage!$X293","v":0},{"$f":"Usage!$W293","v":0},{"$f":"Account!$AA$2","v":0},{"$f":"Usage!$Y293","v":0},{"$f":"Usage!$Z293","v":0},0]
[{"$f":"Tenant!$A294","v":293},{"$f":"Account!$C$2","v":0},{"$f":"Account!$I$2","v":0},{"$f":"Tenant!$B294","v":0},{"$f":"Tenant!$C294","v":0},{"$f":"Tenant!$D294","v":0},{"$f":"Tenant!$E294","v":0},{"$f":"Tenant!$G294","v":0},{"$f":"Usage!$D294","v":"00:00:00"},{"$f":"Usage!$E294","v":"00:00:00"},{"$f":"Usage!$F294","v":0},{"$f":"Usage!$G294","v":0},{"$f":"Usage!$H294","v":0},{"$f":"Usage!$L294","v":0},{"$f":"Account!$AI$2","v":0},{"$f":"Usage!$N294","v":0},{"$f":"Usage!$M294","v":0},{"$f":"Account!$AH$2","v":0},{"$f":"Usage!$O294","v":0},0,{"$f":"Tenant!$H294","v":0},{"$f":"Account!$Y$2/100","v":0},{"$f":"Usage!$R294","v":0},{"$f":"Account!$X$2/100","v":0},{"$f":"Usage!$S294","v":0},{"$f":"Tenant!$I294","v":0},{"$f":"Usage!$V294","v":0},{"$f":"Account!$AB$2","v":0},{"$f":"Usage!$X294","v":0},{"$f":"Usage!$W294","v":0},{"$f":"Account!$AA$2","v":0},{"$f":"Usage!$Y294","v":0},{"$f":"Usage!$Z294","v":0},0]
[{"$f":"Tenant!$A295","v":294},{"$f":"Account!$C$2","v":0},{"$f":"Account!$I$2","v":0},{"$f":"Tenant!$B295","v":0},{"$f":"Tenant!$C295","v":0},{"$f":"Tenant!$D295","v":0},{"$f":"Tenant!$E295","v":0},{"$f":"Tenant!$G295","v":0},{"$f":"Usage!$D295","v":"00:00:00"},{"$f":"Usage!$E295","v":"00:00:00"},{"$f":"Usage!$F295","v":0},{"$f":"Usage!$G295","v":0},{"$f":"Usage!$H295","v":0},{"$f":"Usage!$L295","v":0},{"$f":"Account!$AI$2","v":0},{"$f":"Usage!$N295","v":0},{"$f":"Usage!$M295","v":0},{"$f":"Account!$AH$2","v":0},{"$f":"Usage!$O295","v":0},0,{"$f":"Tenant!$H295","v":0},{"$f":"Account!$Y$2/100","v":0},{"$f":"Usage!$R295","v":0},{"$f":"Account!$X$2/100","v":0},{"$f":"Usage!$S295","v":0},{"$f":"Tenant!$I295","v":0},{"$f":"Usage!$V295","v":0},{"$f":"Account!$AB$2","v":0},{"$f":"Usage!$X295","v":0},{"$f":"Usage!$W295","v":0},{"$f":"Account!$AA$2","v":0},{"$f":"Usage!$Y295","v":0},{"$f":"Usage!$Z295","v":0},0]
[{"$f":"Tenant!$A296","v":295},{"$f":"Account!$C$2","v":0},{"$f":"Account!$I$2","v":0},{"$f":"Tenant!$B296","v":0},{"$f":"Tenant!$C296","v":0},{"$f":"Tenant!$D296","v":0},{"$f":"Tenant!$E296","v":0},{"$f":"Tenant!$G296","v":0},{"$f":"Usage!$D296","v":"00:00:00"},{"$f":"Usage!$E296","v":"00:00:00"},{"$f":"Usage!$F296","v":0},{"$f":"Usage!$G296","v":0},{"$f":"Usage!$H296","v":0},{"$f":"Usage!$L296","v":0},{"$f":"Account!$AI$2","v":0},{"$f":"Usage!$N296","v":0},{"$f":"Usage!$M296","v":0},{"$f":"Account!$AH$2","v":0},{"$f":"Usage!$O296","v":0},0,{"$f":"Tenant!$H296","v":0},{"$f":"Account!$Y$2/100","v":0},{"$f":"Usage!$R296","v":0},{"$f":"Account!$X$2/100","v":0},{"$f":"Usage!$S296","v":0},{"$f":"Tenant!$I296","v":0},{"$f":"Usage!$V296","v":0},{"$f":"Account!$AB$2","v":0},{"$f":"Usage!$X296","v":0},{"$f":"Usage!$W296","v":0},{"$f":"Account!$AA$2","v":0},{"$f":"Usage!$Y296","v":0},{"$f":"Usage!$Z296","v":0},0]
[{"$f":"Tenant!$A297","v":296},{"$f":"Account!$C$2","v":0},{"$f":"Account!$I$2","v":0},{"$f":"Tenant!$B297","v":0},{"$f":"Tenant!$C297","v":0},{"$f":"Tenant!$D297","v":0},{"$f":"Tenant!$E297","v":0},{"$f":"Tenant!$G297","v":0},{"$f":"Usage!$D297","v":"00:00:00"},{"$f":"Usage!$E297","v":"00:00:00"},{"$f":"Usage!$F297","v":0},{"$f":"Usage!$G297","v":0},{"$f":"Usage!$H297","v":0},{"$f":"Usage!$L297","v":0},{"$f":"Account!$AI$2","v":0},{"$f":"Usage!$N297","v":0},{"$f":"Usage!$M297","v":0},{"$f":"Account!$AH$2","v":0},{"$f":"Usage!$O297","v":0},0,{"$f":"Tenant!$H297","v":0},{"$f":"Account!$Y$2/100","v":0},{"$f":"Usage!$R297","v":0},{"$f":"Account!$X$2/100","v":0},{"$f":"Usage!$S297","v":0},{"$f":"Tenant!$I297","v":0},{"$f":"Usage!$V297","v":0},{"$f":"Account!$AB$2","v":0},{"$f":"Usage!$X297","v":0},{"$f":"Usage!$W297","v":0},{"$f":"Account!$AA$2","v":0},{"$f":"Usage!$Y297","v":0},{"$f":"Usage!$Z297","v":0},0]
[{"$f":"Tenant!$A298","v":297},{"$f":"Account!$C$2","v":0},{"$f":"Account!$I$2","v":0},{"$f":"Tenant!$B298","v":0},{"$f":"Tenant!$C298","v":0},{"$f":"Tenant!$D298","v":0},{"$f":"Tenant!$E298","v":0},{"$f":"Tenant!$G298","v":0},{"$f":"Usage!$D298","v":"00:00:00"},{"$f":"Usage!$E298","v":"00:00:00"},{"$f":"Usage!$F298","v":0},{"$f":"Usage!$G298","v":0},{"$f":"Usage!$H298","v":0},{"$f":"Usage!$L298","v":0},{"$f":"Account!$AI$2","v":0},{"$f":"Usage!$N298","v":0},{"$f":"Usage!$M298","v":0},{"$f":"Account!$AH$2","v":0},{"$f":"Usage!$O298","v":0},0,{"$f":"Tenant!$H298","v":0},{"$f":"Account!$Y$2/100","v":0},{"$f":"Usage!$R298","v":0},{"$f":"Account!$X$2/100","v":0},{"$f":"Usage!$S298","v":0},{"$f":"Tenant!$I298","v":0},{"$f":"Usage!$V298","v":0},{"$f":"Account!$AB$2","v":0},{"$f":"Usage!$X298","v":0},{"$f":"Usage!$W298","v":0},{"$f":"Account!$AA$2","v":0},{"$f":"Usage!$Y298","v":0},{"$f":"Usage!$Z298","v":0},0]
[{"$f":"Tenant!$A299","v":298},{"$f":"Account!$C$2","v":0},{"$f":"Account!$I$2","v":0},{"$f":"Tenant!$B299","v":0},{"$f":"Tenant!$C299","v":0},{"$f":"Tenant!$D299","v":0},{"$f":"Tenant!$E299","v":0},{"$f":"Tenant!$G299","v":0},{"$f":"Usage!$D299","v":"00:00:00"},{"$f":"Usage!$E299","v":"00:00:00"},{"$f":"Usage!$F299","v":0},{"$f":"Usage!$G299","v":0},{"$f":"Usage!$H299","v":0},{"$f":"Usage!$L299","v":0},{"$f":"Account!$AI$2","v":0},{"$f":"Usage!$N299","v":0},{"$f":"Usage!$M299","v":0},{"$f":"Account!$AH$2","v":0},{"$f":"Usage!$O299","v":0},0,{"$f":"Tenant!$H299","v":0},{"$f":"Account!$Y$2/100","v":0},{"$f":"Usage!$R299","v":0},{"$f":"Account!$X$2/100","v":0},{"$f":"Usage!$S299","v":0},{"$f":"Tenant!$I299","v":0},{"$f":"Usage!$V299","v":0},{"$f":"Account!$AB$2","v":0},{"$f":"Usage!$X299","v":0},{"$f":"Usage!$W299","v":0},{"$f":"Account!$AA$2","v":0},{"$f":"Usage!$Y299","v":0},{"$f":"Usage!$Z299","v":0},0]
[{"$f":"Tenant!$A300","v":299},{"$f":"Account!$C$2","v":0},{"$f":"Account!$I$2","v":0},{"$f":"Tenant!$B300","v":0},{"$f":"Tenant!$C300","v":0},{"$f":"Tenant!$D300","v":0},{"$f":"Tenant!$E300","v":0},{"$f":"Tenant!$G300","v":0},{"$f":"Usage!$D300","v":"00:00:00"},{"$f":"Usage!$E300","v":"00:00:00"},{"$f":"Usage!$F300","v":0},{"$f":"Usage!$G300","v":0},{"$f":"Usage!$H300","v":0},{"$f":"Usage!$L300","v":0},{"$f":"Account!$AI$2","v":0},{"$f":"Usage!$N300","v":0},{"$f":"Usage!$M300","v":0},{"$f":"Account!$AH$2","v":0},{"$f":"Usage!$O300","v":0},0,{"$f":"Tenant!$H300","v":0},{"$f":"Account!$Y$2/100","v":0},{"$f":"Usage!$R300","v":0},{"$f":"Account!$X$2/100","v":0},{"$f":"Usage!$S300","v":0},{"$f":"Tenant!$I300","v":0},{"$f":"Usage!$V300","v":0},{"$f":"Account!$AB$2","v":0},{"$f":"Usage!$X300","v":0},{"$f":"Usage!$W300","v":0},{"$f":"Account!$AA$2","v":0},{"$f":"Usage!$Y300","v":0},{"$f":"Usage!$Z300","v":0},0]
[{"$f":"Tenant!$A301","v":300},{"$f":"Account!$C$2","v":0},{"$f":"Account!$I$2","v":0},{"$f":"Tenant!$B301","v":0},{"$f":"Tenant!$C301","v":0},{"$f":"Tenant!$D301","v":0},{"$f":"Tenant!$E301","v":0},{"$f":"Tenant!$G301","v":0},{"$f":"Usage!$D301","v":"00:00:00"},{"$f":"Usage!$E301","v":"00:00:00"},{"$f":"Usage!$F301","v":0},{"$f":"Usage!$G301","v":0},{"$f":"Usage!$H301","v":0},{"$f":"Usage!$L301","v":0},{"$f":"Account!$AI$2","v":0},{"$f":"Usage!$N301","v":0},{"$f":"Usage!$M301","v":0},{"$f":"Account!$AH$2","v":0},{"$f":"Usage!$O301","v":0},0,{"$f":"Tenant!$H301","v":0},{"$f":"Account!$Y$2/100","v":0},{"$f":"Usage!$R301","v":0},{"$f":"Account!$X$2/100","v":0},{"$f":"Usage!$S301","v":0},{"$f":"Tenant!$I301","v":0},{"$f":"Usage!$V301","v":0},{"$f":"Account!$AB$2","v":0},{"$f":"Usage!$X301","v":0},{"$f":"Usage!$W301","v":0},{"$f":"Account!$AA$2","v":0},{"$f":"Usage!$Y301","v":0},{"$f":"Usage!$Z301","v":0},0]

{"sheet":"BllTmplt","index":7,"n_rows":29,"n_cols":8,"rows_kept":29,"cut":false,"hidden":true,"merged":[[26,0,26,2],[21,0,21,2],[28,0,28,2],[22,0,22,2],[23,0,23,2],[24,0,24,2],[25,0,25,2],[27,0,27,2],[18,0,18,2],[16,0,16,2],[17,0,17,2],[1,0,3,6],[19,0,19,2]]}
[]
["Southern California Edison (SCE) has prepared a bill calculation from information provided by the Mobilehome Park (MHP) management.  Payment should be sent as directed by MHP management.  DO NOT SEND PAYMENTS TO SCE.  For questions, please contact property owner/management."]
[]
[]
[]
[1]
[{"$f":"IF(ISBLANK(Account!H2),\"\",Account!H2)","v":""}]
[{"$f":"\"Owner Name: \"&VLOOKUP($A$6,BllSmmry!A:AH,2,FALSE)","v":"Owner Name: 0"}]
[{"$f":"\"Owner Rate: \"&VLOOKUP($A$6,BllSmmry!A:AH,3,FALSE)","v":"Owner Rate: 0"}]
[{"$f":"\"Tenant Name: \"&VLOOKUP($A$6,BllSmmry!A:AH,4,FALSE)","v":"Tenant Name: 0"}]
[{"$f":"\"Tenant Address: \"&VLOOKUP($A$6,BllSmmry!A:AH,5,FALSE)","v":"Tenant Address: 0"}]
[{"$f":"\"Tenant Number: \"&VLOOKUP($A$6,BllSmmry!A:AH,6,FALSE)","v":"Tenant Number: 0"}]
[]
["Rate Schedule","Medical Baseline","Start Date","End Date","Start Read","End Read","Total Usage"]
[{"$f":"VLOOKUP($A$6,BllSmmry!A:AH,7,FALSE)","v":0},{"$f":"VLOOKUP($A$6,BllSmmry!A:AH,8,FALSE)","v":0},{"$f":"VLOOKUP($A$6,BllSmmry!A:AH,9,FALSE)","v":"00:00:00"},{"$f":"VLOOKUP($A$6,BllSmmry!A:AH,10,FALSE)","v":"00:00:00"},{"$f":"VLOOKUP($A$6,BllSmmry!A:AH,11,FALSE)","v":0},{"$f":"VLOOKUP($A$6,BllSmmry!A:AH,12,FALSE)","v":0},{"$f":"VLOOKUP($A$6,BllSmmry!A:AH,13,FALSE)","v":0}]
[]
["Generation Charges"]
["Community Choice Aggregation (CCA) - Total",null,null,{"$f":"IF($F$18=$F$19,SUM(VLOOKUP($A$6,BllSmmry!A:AH,14,FALSE),VLOOKUP($A$6,BllSmmry!A:AH,17,FALSE)),VLOOKUP($A$6,BllSmmry!A:AH,14,FALSE))&\" kWh\"","v":"0 kWh"},"x",{"$f":"VLOOKUP($A$6,BllSmmry!A:AH,15,FALSE)","v":0},{"$f":"IF($F$18=$F$19,SUM(VLOOKUP($A$6,BllSmmry!A:AH,16,FALSE),VLOOKUP($A$6,BllSmmry!A:AH,19,FALSE)),VLOOKUP($A$6,BllSmmry!A:AH,16,FALSE))","v":0},{"$f":"IF(OR($G18<0,$G18>0),\"\",\"x\")","v":"x"}]
["Community Choice Aggregation (CCA) - Total",null,null,{"$f":"IF($F$19=$F$18,0,VLOOKUP($A$6,BllSmmry!A:AH,17,FALSE))&\" kWh\"","v":"0 kWh"},"x",{"$f":"VLOOKUP($A$6,BllSmmry!A:AH,18,FALSE)","v":0},{"$f":"IF($F$19=$F$18,0,VLOOKUP($A$6,BllSmmry!A:AH,19,FALSE))","v":0},{"$f":"IF(OR($G19<0,$G19>0),\"\",\"x\")","v":"x"}]
["CCA Generation Subtotal",null,null,null,null,null,{"$f":"VLOOKUP($A$6,BllSmmry!A:AH,20,FALSE)","v":0},{"$f":"IF(OR($G20<0,$G20>0),\"\",\"x\")","v":"x"}]
[]
["UUT Exempt",null,null,null,null,null,{"$f":"VLOOKUP($A$6,BllSmmry!A:AH,21,FALSE)","v":0},{"$f":"IF($G22=TRUE,\"\",\"x\")","v":"x"}]
["Utility Users Tax",null,null,{"$f":"VLOOKUP($A$6,BllSmmry!A:AH,20,FALSE)","v":0},"x",{"$f":"VLOOKUP($A$6,BllSmmry!A:AH,22,FALSE)","v":0},{"$f":"VLOOKUP($A$6,BllSmmry!A:AH,23,FALSE)","v":0},{"$f":"IF(OR($G23<0,$G23>0),\"\",\"x\")","v":"x"}]
["Utility Users Tax",null,null,{"$f":"VLOOKUP($A$6,BllSmmry!A:AH,20,FALSE)","v":0},"x",{"$f":"VLOOKUP($A$6,BllSmmry!A:AH,24,FALSE)","v":0},{"$f":"VLOOKUP($A$6,BllSmmry!A:AH,25,FALSE)","v":0},{"$f":"IF(OR($G24<0,$G24>0),\"\",\"x\")","v":"x"}]
["Energy Surcharge Exempt",null,null,null,null,null,{"$f":"VLOOKUP($A$6,BllSmmry!A:AH,26,FALSE)","v":0},{"$f":"IF($G25=TRUE,\"\",\"x\")","v":"x"}]
["Energy Surcharge",null,null,{"$f":"VLOOKUP($A$6,BllSmmry!A:AH,27,FALSE)&\" kWh\"","v":"0 kWh"},"x",{"$f":"VLOOKUP($A$6,BllSmmry!A:AH,28,FALSE)","v":0},{"$f":"VLOOKUP($A$6,BllSmmry!A:AH,29,FALSE)","v":0},{"$f":"IF(OR($G26<0,$G26>0),\"\",\"x\")","v":"x"}]
["Energy Surcharge",null,null,{"$f":"VLOOKUP($A$6,BllSmmry!A:AH,30,FALSE)&\" kWh\"","v":"0 kWh"},"x",{"$f":"VLOOKUP($A$6,BllSmmry!A:AH,31,FALSE)","v":0},{"$f":"VLOOKUP($A$6,BllSmmry!A:AH,32,FALSE)","v":0},{"$f":"IF(OR($G27<0,$G27>0),\"\",\"x\")","v":"x"}]
["Sub-Total of CCA Generation Charges",null,null,null,null,null,{"$f":"VLOOKUP($A$6,BllSmmry!A:AH,33,FALSE)","v":0}]
["Your new charges",null,null,null,null,null,{"$f":"VLOOKUP($A$6,BllSmmry!A:AH,34,FALSE)","v":0}]

{"sheet":"Dt1","index":8,"n_rows":0,"n_cols":0,"rows_kept":0,"cut":false,"hidden":true,"merged":[]}

{"sheet":"Dt2","index":9,"n_rows":0,"n_cols":0,"rows_kept":0,"cut":false,"hidden":true,"merged":[]}

{"sheet":"Data","index":10,"n_rows":1,"n_cols":1,"rows_kept":1,"cut":false,"hidden":true,"merged":[]}
["Southern California Edison (SCE) has prepared a bill calculation from information provided by the Mobilehome Park (MHP) management.  Payment should be sent as directed by MHP management.  DO NOT SEND PAYMENTS TO SCE.  For questions, please contact property owner/management."]