{"text_format":"1","workbook":"xlsx","n_sheets":11,"sheets":["Enable Content Message","Main","Account","Tenant","Usage","ACTVMHPACCNT","BllSmmry","BllTmplt","Dt1","Dt2","Data"],"not_rendered":{"charts":0,"images":8,"macros":1,"external_links":0,"defined_names":3,"comments":0,"pivot_tables":0},"unopened":[],"bounds":{"document_bytes":16777216,"sheet_cells":100000,"rows_first":2000,"rows_last":500,"rows_between":2000,"halvings":0,"cell_chars":16384,"cell_head_chars":4096},"cells_cut":0,"cells_raw":0,"read":"whole","date_system":"1900"}

{"sheet":"Enable Content Message","index":0,"n_rows":0,"n_cols":0,"rows_kept":0,"cut":false,"hidden":false,"merged":[]}

{"sheet":"Main","index":1,"n_rows":20,"n_cols":2,"rows_kept":20,"cut":false,"hidden":true,"merged":[[5,0,7,13],[13,1,14,13]]}
[]
[]
[]
[]
[]
["By submission of using this tenant bill calculation tool, I state that the information entered is correct, that I am a Southern California Edison® customer with a DMS-2 account, receiving Community Choice Aggregation service, and I have enrolled in the Tenant Bill Calculation Service."]
[]
[]
[]
["I understand:"]
{"$rows_left_out":11}
{"sheet":"Account","index":2,"n_rows":2,"n_cols":36,"rows_kept":2,"cut":false,"hidden":true,"merged":[]}
["ID","CntrctNmbr","CntrctNm","StrtAddrss","Cty","Stt","ZpCd","EmlAddrss","BllngRt","BllPrdStrtDt","BllPrdEndDt","SbMtrMxRd","DrctAccss","TrnstnlBndldSrvcDrctAccss","CntnsDrctAccss","RtrnngCntnsDrctAccss","CmmntyChcAggrgtn","TrnstnlBndldSrvcCmmntyChcAggrgtn","VntgYr","TrnstnlBndldSrvcFctr","MltDwllng","NEM2.0","NBCkWh","UUTCrrnt","UUTPrvs","UUTChngDt","SttTxCrrnt","SttTxPrvs","SttTxChngDt","CtyFrnchsSrchrgSntBrbr","CtyFrnchsSrchrgVntr","TrnstnlBndldSrvc","BndldCstmr","CCACrrnt","CCAPrvs","CCAChngDt"]
["1",null,null,null,null,null,null,null,null,null,null,null,null,null,null,null,null,null,null,null,null,null,null,null,null,null,null,null,null,null,null,{"$f":"IF(OR($N2=TRUE,$R2=TRUE),TRUE,FALSE)","v":false},{"$f":"IF(AND($N2=FALSE,$R2=FALSE,$M2=FALSE,Q$2=FALSE),TRUE,FALSE)","v":true}]

{"sheet":"Tenant","index":3,"n_rows":301,"n_cols":10,"rows_kept":301,"cut":false,"hidden":true,"merged":[]}
["ID","TnntNm","TnntAddrss","TnntNmbr","SbMtrBllngRt","MdclBslnAllctn","MdclDvcs","UUTExmpt","SttTxExmpt","AllElctrc"]
[1]
[2]
[3]
[4]
[5]
[6]
[7]
[8]
[9]
{"$rows_left_out":292}
{"sheet":"Usage","index":4,"n_rows":301,"n_cols":26,"rows_kept":301,"cut":false,"hidden":true,"merged":[]}
["ID","TnntNm","TnntNmbr","BllPrdStrtDt","BllPrdEndDt","SbMtrRdStrt","SbMtrRdEnd","TtlUsg","TtlNmbrOfDys","OldDysCCARt","NwDysCCARt","OldkWhCCARt","NwkWhCCARt","CCARtPrvs","CCARtCrrnt","OldDysCCAUUTTx","NwDysCCAUUTTx","CCAUUTTxPrvs","CCAUUTTxCrrnt","OldDysCCAEnrgySrchrg","NwDysCCAEnrgySrchrg","OldkWhCCAEnrgySrchrg","NwkWhCCAEnrgySrchrg","CCAEnrgySrchrgPrvs","CCAEnrgySrchrgCrrnt","CCASbttlOfChrgs"]
[1,null,null,null,null,null,null,null,{"$f":"SUM($E2-$D2+1)","v":1},{"$f":"IF(Account!$AJ$2=0,0,SUM(Account!$AJ$2-$D2))","v":0},{"$f":"SUM($I2-$J2)","v":1},{"$f":"ROUND(IF($J2=0,0,SUM($H2/$I2*$K2)),2)","v":0},{"$f":"ROUND(SUM($H2-$L2),2)","v":0},{"$f":"ROUND(SUM($L2*Account!$AI$2),2)","v":0},{"$f":"ROUND(SUM($M2*Account!$AH$2),2)","v":0},{"$f":"IF(Account!$Z$2=0,0,SUM(Account!$Z$2-$D2))","v":0},{"$f":"SUM($I2-$P2)","v":1},{"$f":"SUM(SUM(SUM(SUM($N2:$O2)/$I2*$P2)*Account!$Y$2)/100)","v":0},{"$f":"SUM(SUM(SUM(SUM($N2:$O2)/$I2*$Q2)*Account!$X$2)/100)","v":0},{"$f":"IF(Account!$AC$2=0,0,SUM(Account!$AC$2-$D2))","v":0},{"$f":"SUM($I2-$T2)","v":1},{"$f":"ROUND(IF($T2=0,0,SUM($H2/$I2*$T2)),2)","v":0},{"$f":"ROUND(SUM($H2-$V2),2)","v":0},{"$f":"SUM($V2*Account!$AB$2)","v":0},{"$f":"SUM($W2*Account!$AA$2)","v":0},{"$f":"SUM($N2:$O2,$R2:$S2,$X2:$Y2)","v":0}]
[2,null,null,null,null,null,null,null,{"$f":"SUM($E3-$D3+1)","v":1},{"$f":"IF(Account!$AJ$2=0,0,SUM(Account!$AJ$2-$D3))","v":0},1,{"$f":"ROUND(IF($J3=0,0,SUM($H3/$I3*$K3)),2)","v":0},{"$f":"ROUND(SUM($H3-$L3),2)","v":0},{"$f":"ROUND(SUM($L3*Account!$AI$2),2)","v":0},{"$f":"ROUND(SUM($M3*Account!$AH$2),2)","v":0},{"$f":"IF(Account!$Z$2=0,0,SUM(Account!$Z$2-$D3))","v":0},1,{"$f":"SUM(SUM(SUM(SUM($N3:$O3)/$I3*$P3)*Account!$Y$2)/100)","v":0},{"$f":"SUM(SUM(SUM(SUM($N3:$O3)/$I3*$Q3)*Account!$X$2)/100)","v":0},{"$f":"IF(Account!$AC$2=0,0,SUM(Account!$AC$2-$D3))","v":0},1,{"$f":"ROUND(IF($T3=0,0,SUM($H3/$I3*$T3)),2)","v":0},{"$f":"ROUND(SUM($H3-$V3),2)","v":0},{"$f":"SUM($V3*Account!$AB$2)","v":0},{"$f":"SUM($W3*Account!$AA$2)","v":0},{"$f":"SUM($N3:$O3,$R3:$S3,$X3:$Y3)","v":0}]
[3,null,null,null,null,null,null,null,1,{"$f":"IF(Account!$AJ$2=0,0,SUM(Account!$AJ$2-$D4))","v":0},1,0,0,{"$f":"ROUND(SUM($L4*Account!$AI$2),2)","v":0},{"$f":"ROUND(SUM($M4*Account!$AH$2),2)","v":0},{"$f":"IF(Account!$Z$2=0,0,SUM(Account!$Z$2-$D4))","v":0},1,{"$f":"SUM(SUM(SUM(SUM($N4:$O4)/$I4*$P4)*Account!$Y$2)/100)","v":0},{"$f":"SUM(SUM(SUM(SUM($N4:$O4)/$I4*$Q4)*Account!$X$2)/100)","v":0},{"$f":"IF(Account!$AC$2=0,0,SUM(Account!$AC$2-$D4))","v":0},1,0,0,{"$f":"SUM($V4*Account!$AB$2)","v":0},{"$f":"SUM($W4*Account!$AA$2)","v":0},0]
[4,null,null,null,null,null,null,null,1,{"$f":"IF(Account!$AJ$2=0,0,SUM(Account!$AJ$2-$D5))","v":0},1,0,0,{"$f":"ROUND(SUM($L5*Account!$AI$2),2)","v":0},{"$f":"ROUND(SUM($M5*Account!$AH$2),2)","v":0},{"$f":"IF(Account!$Z$2=0,0,SUM(Account!$Z$2-$D5))","v":0},1,{"$f":"SUM(SUM(SUM(SUM($N5:$O5)/$I5*$P5)*Account!$Y$2)/100)","v":0},{"$f":"SUM(SUM(SUM(SUM($N5:$O5)/$I5*$Q5)*Account!$X$2)/100)","v":0},{"$f":"IF(Account!$AC$2=0,0,SUM(Account!$AC$2-$D5))","v":0},1,0,0,{"$f":"SUM($V5*Account!$AB$2)","v":0},{"$f":"SUM($W5*Account!$AA$2)","v":0},0]
[5,null,null,null,null,null,null,null,1,{"$f":"IF(Account!$AJ$2=0,0,SUM(Account!$AJ$2-$D6))","v":0},1,0,0,{"$f":"ROUND(SUM($L6*Account!$AI$2),2)","v":0},{"$f":"ROUND(SUM($M6*Account!$AH$2),2)","v":0},{"$f":"IF(Account!$Z$2=0,0,SUM(Account!$Z$2-$D6))","v":0},1,{"$f":"SUM(SUM(SUM(SUM($N6:$O6)/$I6*$P6)*Account!$Y$2)/100)","v":0},{"$f":"SUM(SUM(SUM(SUM($N6:$O6)/$I6*$Q6)*Account!$X$2)/100)","v":0},{"$f":"IF(Account!$AC$2=0,0,SUM(Account!$AC$2-$D6))","v":0},1,0,0,{"$f":"SUM($V6*Account!$AB$2)","v":0},{"$f":"SUM($W6*Account!$AA$2)","v":0},0]
[6,null,null,null,null,null,null,null,1,{"$f":"IF(Account!$AJ$2=0,0,SUM(Account!$AJ$2-$D7))","v":0},1,0,0,{"$f":"ROUND(SUM($L7*Account!$AI$2),2)","v":0},{"$f":"ROUND(SUM($M7*Account!$AH$2),2)","v":0},{"$f":"IF(Account!$Z$2=0,0,SUM(Account!$Z$2-$D7))","v":0},1,{"$f":"SUM(SUM(SUM(SUM($N7:$O7)/$I7*$P7)*Account!$Y$2)/100)","v":0},{"$f":"SUM(SUM(SUM(SUM($N7:$O7)/$I7*$Q7)*Account!$X$2)/100)","v":0},{"$f":"IF(Account!$AC$2=0,0,SUM(Account!$AC$2-$D7))","v":0},1,0,0,{"$f":"SUM($V7*Account!$AB$2)","v":0},{"$f":"SUM($W7*Account!$AA$2)","v":0},0]
[7,null,null,null,null,null,null,null,1,{"$f":"IF(Account!$AJ$2=0,0,SUM(Account!$AJ$2-$D8))","v":0},1,0,0,{"$f":"ROUND(SUM($L8*Account!$AI$2),2)","v":0},{"$f":"ROUND(SUM($M8*Account!$AH$2),2)","v":0},{"$f":"IF(Account!$Z$2=0,0,SUM(Account!$Z$2-$D8))","v":0},1,{"$f":"SUM(SUM(SUM(SUM($N8:$O8)/$I8*$P8)*Account!$Y$2)/100)","v":0},{"$f":"SUM(SUM(SUM(SUM($N8:$O8)/$I8*$Q8)*Account!$X$2)/100)","v":0},{"$f":"IF(Account!$AC$2=0,0,SUM(Account!$AC$2-$D8))","v":0},1,0,0,{"$f":"SUM($V8*Account!$AB$2)","v":0},{"$f":"SUM($W8*Account!$AA$2)","v":0},0]
[8,null,null,null,null,null,null,null,1,{"$f":"IF(Account!$AJ$2=0,0,SUM(Account!$AJ$2-$D9))","v":0},1,0,0,{"$f":"ROUND(SUM($L9*Account!$AI$2),2)","v":0},{"$f":"ROUND(SUM($M9*Account!$AH$2),2)","v":0},{"$f":"IF(Account!$Z$2=0,0,SUM(Account!$Z$2-$D9))","v":0},1,{"$f":"SUM(SUM(SUM(SUM($N9:$O9)/$I9*$P9)*Account!$Y$2)/100)","v":0},{"$f":"SUM(SUM(SUM(SUM($N9:$O9)/$I9*$Q9)*Account!$X$2)/100)","v":0},{"$f":"IF(Account!$AC$2=0,0,SUM(Account!$AC$2-$D9))","v":0},1,0,0,{"$f":"SUM($V9*Account!$AB$2)","v":0},{"$f":"SUM($W9*Account!$AA$2)","v":0},0]
[9,null,null,null,null,null,null,null,1,{"$f":"IF(Account!$AJ$2=0,0,SUM(Account!$AJ$2-$D10))","v":0},1,0,0,{"$f":"ROUND(SUM($L10*Account!$AI$2),2)","v":0},{"$f":"ROUND(SUM($M10*Account!$AH$2),2)","v":0},{"$f":"IF(Account!$Z$2=0,0,SUM(Account!$Z$2-$D10))","v":0},1,{"$f":"SUM(SUM(SUM(SUM($N10:$O10)/$I10*$P10)*Account!$Y$2)/100)","v":0},{"$f":"SUM(SUM(SUM(SUM($N10:$O10)/$I10*$Q10)*Account!$X$2)/100)","v":0},{"$f":"IF(Account!$AC$2=0,0,SUM(Account!$AC$2-$D10))","v":0},1,0,0,{"$f":"SUM($V10*Account!$AB$2)","v":0},{"$f":"SUM($W10*Account!$AA$2)","v":0},0]
{"$rows_left_out":292}
{"sheet":"ACTVMHPACCNT","index":5,"n_rows":30,"n_cols":17,"rows_kept":30,"cut":false,"hidden":true,"merged":[]}
["Cntrct","Nm","StrtAddrss","Cty","Stt","ZpCd","Instlltn","DtFrm","DtTo","MPH","Mlt_Dwllng","CCA","DA","DACntns","DARtrnngCntns","VntgYr","BslnRgn"]
[8000096981,"TERESA JACOBS","3639 W INYOKERN RD","RIDGECREST","CA","93555-8547",901740529,"2010-09-27","9999-12-31","X","X",null,null,null,null,".",14]
[8000101192,"LEEDS PROP MGT 05","1404 GLENWOOD LN","BISHOP","CA","93514-1921",901725622,"2012-02-29","9999-12-31","X","X",null,null,null,null,".",16]
[8000263668,"SANDS MOBILE HOME PARK","415 W RIDGECREST BLVD","RIDGECREST","CA","93555-4046",904358684,"2010-09-27","9999-12-31","X","X",null,null,null,null,".",14]
[8000546385,"MARK SZYMANSKI","26925 LADERA ST","REDLANDS","CA","92373-4373",905174431,"2014-01-28","9999-12-31","X","X",null,null,null,null,".",10]
[8000736604,"DAVID THOR","21592 BUNDY CANYON RD","WILDOMAR","CA","92595-8776",901750943,"2019-10-11","9999-12-31","X","X",null,null,null,null,".",16]
[8001808742,"HIDDEN BEACHES RIVR RESORT LLC","6951 6TH AVE","BLYTHE","CA","92225-9330",900606158,"2006-07-03","9999-12-31","X","X",null,null,null,null,".",15]
[8001808839,"HIDDEN BEACHES RIVR RESORT LLC","6951 6TH AVE","BLYTHE","CA","92225-9330",902863306,"2006-07-03","9999-12-31","X","X",null,null,null,null,".",15]
[8001839457,"THOMPSON AND ALLEN","26 S VENTU PARK RD","NEWBURY PARK","CA","91320-3942",901713715,"2018-04-10","9999-12-31","X","X","X",null,null,null,".",9]
[8002061817,"MITCHELL AVENUE E PARK, INC","1024 DELAWARE RD","BURBANK","CA","91504-3025",903630857,"2014-04-10","9999-12-31","X","X",null,null,null,null,".",14]
{"$rows_left_out":21}
{"sheet":"BllSmmry","index":6,"n_rows":301,"n_cols":34,"rows_kept":301,"cut":false,"hidden":true,"merged":[]}
[{"$f":"Tenant!$A1","v":"ID"},{"$f":"Account!$C$1","v":"CntrctNm"},{"$f":"Account!$I$1","v":"BllngRt"},{"$f":"Tenant!$B1","v":"TnntNm"},{"$f":"Tenant!$C1","v":"TnntAddrss"},{"$f":"Tenant!$D1","v":"TnntNmbr"},{"$f":"Tenant!$E1","v":"SbMtrBllngRt"},{"$f":"Tenant!$G1","v":"MdclDvcs"},{"$f":"Usage!$D1","v":"BllPrdStrtDt"},{"$f":"Usage!$E1","v":"BllPrdEndDt"},{"$f":"Usage!$F1","v":"SbMtrRdStrt"},{"$f":"Usage!$G1","v":"SbMtrRdEnd"},{"$f":"Usage!$H1","v":"TtlUsg"},{"$f":"Usage!$L1","v":"OldkWhCCARt"},{"$f":"Usage!$N1","v":"CCARtPrvs"},{"$f":"Usage!$N1&\"Ttl\"","v":"CCARtPrvsTtl"},{"$f":"Usage!$M1","v":"NwkWhCCARt"},{"$f":"Usage!$O1","v":"CCARtCrrnt"},{"$f":"Usage!$O1&\"Ttl\"","v":"CCARtCrrntTtl"},"CCAGnrtnSbttl",{"$f":"Tenant!$H1","v":"UUTExmpt"},{"$f":"Account!$Y$1","v":"UUTPrvs"},{"$f":"Usage!$R1","v":"CCAUUTTxPrvs"},{"$f":"Account!$X$1","v":"UUTCrrnt"},{"$f":"Usage!$S1","v":"CCAUUTTxCrrnt"},{"$f":"Tenant!$I1","v":"SttTxExmpt"},{"$f":"Usage!$V1","v":"OldkWhCCAEnrgySrchrg"},{"$f":"Account!$AB$1&\"Fctr\"","v":"SttTxPrvsFctr"},{"$f":"Usage!$X1","v":"CCAEnrgySrchrgPrvs"},{"$f":"Usage!$W1","v":"NwkWhCCAEnrgySrchrg"},{"$f":"Account!$AA$1&\"Fctr\"","v":"SttTxCrrntFctr"},{"$f":"Usage!$Y1","v":"CCAEnrgySrchrgCrrnt"},{"$f":"Usage!$Z1","v":"CCASbttlOfChrgs"},"YrNwChrgs"]
[{"$f":"Tenant!$A2","v":1},{"$f":"Account!$C$2","v":0},{"$f":"Account!$I$2","v":0},{"$f":"Tenant!$B2","v":0},{"$f":"Tenant!$C2","v":0},{"$f":"Tenant!$D2","v":0},{"$f":"Tenant!$E2","v":0},{"$f":"Tenant!$G2","v":0},{"$f":"Usage!$D2","v":"00:00:00"},{"$f":"Usage!$E2","v":"00:00:00"},{"$f":"Usage!$F2","v":0},{"$f":"Usage!$G2","v":0},{"$f":"Usage!$H2","v":0},{"$f":"Usage!$L2","v":0},{"$f":"Account!$AI$2","v":0},{"$f":"Usage!$N2","v":0},{"$f":"Usage!$M2","v":0},{"$f":"Account!$AH$2","v":0},{"$f":"Usage!$O2","v":0},{"$f":"SUM($P2,$S2)","v":0},{"$f":"Tenant!$H2","v":0},{"$f":"Account!$Y$2/100","v":0},{"$f":"Usage!$R2","v":0},{"$f":"Account!$X$2/100","v":0},{"$f":"Usage!$S2","v":0},{"$f":"Tenant!$I2","v":0},{"$f":"Usage!$V2","v":0},{"$f":"Account!$AB$2","v":0},{"$f":"Usage!$X2","v":0},{"$f":"Usage!$W2","v":0},{"$f":"Account!$AA$2","v":0},{"$f":"Usage!$Y2","v":0},{"$f":"Usage!$Z2","v":0},{"$f":"$AG2","v":0}]
[{"$f":"Tenant!$A3","v":2},{"$f":"Account!$C$2","v":0},{"$f":"Account!$I$2","v":0},{"$f":"Tenant!$B3","v":0},{"$f":"Tenant!$C3","v":0},{"$f":"Tenant!$D3","v":0},{"$f":"Tenant!$E3","v":0},{"$f":"Tenant!$G3","v":0},{"$f":"Usage!$D3","v":"00:00:00"},{"$f":"Usage!$E3","v":"00:00:00"},{"$f":"Usage!$F3","v":0},{"$f":"Usage!$G3","v":0},{"$f":"Usage!$H3","v":0},{"$f":"Usage!$L3","v":0},{"$f":"Account!$AI$2","v":0},{"$f":"Usage!$N3","v":0},{"$f":"Usage!$M3","v":0},{"$f":"Account!$AH$2","v":0},{"$f":"Usage!$O3","v":0},{"$f":"SUM($P3,$S3)","v":0},{"$f":"Tenant!$H3","v":0},{"$f":"Account!$Y$2/100","v":0},{"$f":"Usage!$R3","v":0},{"$f":"Account!$X$2/100","v":0},{"$f":"Usage!$S3","v":0},{"$f":"Tenant!$I3","v":0},{"$f":"Usage!$V3","v":0},{"$f":"Account!$AB$2","v":0},{"$f":"Usage!$X3","v":0},{"$f":"Usage!$W3","v":0},{"$f":"Account!$AA$2","v":0},{"$f":"Usage!$Y3","v":0},{"$f":"Usage!$Z3","v":0},{"$f":"$AG3","v":0}]
[{"$f":"Tenant!$A4","v":3},{"$f":"Account!$C$2","v":0},{"$f":"Account!$I$2","v":0},{"$f":"Tenant!$B4","v":0},{"$f":"Tenant!$C4","v":0},{"$f":"Tenant!$D4","v":0},{"$f":"Tenant!$E4","v":0},{"$f":"Tenant!$G4","v":0},{"$f":"Usage!$D4","v":"00:00:00"},{"$f":"Usage!$E4","v":"00:00:00"},{"$f":"Usage!$F4","v":0},{"$f":"Usage!$G4","v":0},{"$f":"Usage!$H4","v":0},{"$f":"Usage!$L4","v":0},{"$f":"Account!$AI$2","v":0},{"$f":"Usage!$N4","v":0},{"$f":"Usage!$M4","v":0},{"$f":"Account!$AH$2","v":0},{"$f":"Usage!$O4","v":0},0,{"$f":"Tenant!$H4","v":0},{"$f":"Account!$Y$2/100","v":0},{"$f":"Usage!$R4","v":0},{"$f":"Account!$X$2/100","v":0},{"$f":"Usage!$S4","v":0},{"$f":"Tenant!$I4","v":0},{"$f":"Usage!$V4","v":0},{"$f":"Account!$AB$2","v":0},{"$f":"Usage!$X4","v":0},{"$f":"Usage!$W4","v":0},{"$f":"Account!$AA$2","v":0},{"$f":"Usage!$Y4","v":0},{"$f":"Usage!$Z4","v":0},0]
[{"$f":"Tenant!$A5","v":4},{"$f":"Account!$C$2","v":0},{"$f":"Account!$I$2","v":0},{"$f":"Tenant!$B5","v":0},{"$f":"Tenant!$C5","v":0},{"$f":"Tenant!$D5","v":0},{"$f":"Tenant!$E5","v":0},{"$f":"Tenant!$G5","v":0},{"$f":"Usage!$D5","v":"00:00:00"},{"$f":"Usage!$E5","v":"00:00:00"},{"$f":"Usage!$F5","v":0},{"$f":"Usage!$G5","v":0},{"$f":"Usage!$H5","v":0},{"$f":"Usage!$L5","v":0},{"$f":"Account!$AI$2","v":0},{"$f":"Usage!$N5","v":0},{"$f":"Usage!$M5","v":0},{"$f":"Account!$AH$2","v":0},{"$f":"Usage!$O5","v":0},0,{"$f":"Tenant!$H5","v":0},{"$f":"Account!$Y$2/100","v":0},{"$f":"Usage!$R5","v":0},{"$f":"Account!$X$2/100","v":0},{"$f":"Usage!$S5","v":0},{"$f":"Tenant!$I5","v":0},{"$f":"Usage!$V5","v":0},{"$f":"Account!$AB$2","v":0},{"$f":"Usage!$X5","v":0},{"$f":"Usage!$W5","v":0},{"$f":"Account!$AA$2","v":0},{"$f":"Usage!$Y5","v":0},{"$f":"Usage!$Z5","v":0},0]
[{"$f":"Tenant!$A6","v":5},{"$f":"Account!$C$2","v":0},{"$f":"Account!$I$2","v":0},{"$f":"Tenant!$B6","v":0},{"$f":"Tenant!$C6","v":0},{"$f":"Tenant!$D6","v":0},{"$f":"Tenant!$E6","v":0},{"$f":"Tenant!$G6","v":0},{"$f":"Usage!$D6","v":"00:00:00"},{"$f":"Usage!$E6","v":"00:00:00"},{"$f":"Usage!$F6","v":0},{"$f":"Usage!$G6","v":0},{"$f":"Usage!$H6","v":0},{"$f":"Usage!$L6","v":0},{"$f":"Account!$AI$2","v":0},{"$f":"Usage!$N6","v":0},{"$f":"Usage!$M6","v":0},{"$f":"Account!$AH$2","v":0},{"$f":"Usage!$O6","v":0},0,{"$f":"Tenant!$H6","v":0},{"$f":"Account!$Y$2/100","v":0},{"$f":"Usage!$R6","v":0},{"$f":"Account!$X$2/100","v":0},{"$f":"Usage!$S6","v":0},{"$f":"Tenant!$I6","v":0},{"$f":"Usage!$V6","v":0},{"$f":"Account!$AB$2","v":0},{"$f":"Usage!$X6","v":0},{"$f":"Usage!$W6","v":0},{"$f":"Account!$AA$2","v":0},{"$f":"Usage!$Y6","v":0},{"$f":"Usage!$Z6","v":0},0]
[{"$f":"Tenant!$A7","v":6},{"$f":"Account!$C$2","v":0},{"$f":"Account!$I$2","v":0},{"$f":"Tenant!$B7","v":0},{"$f":"Tenant!$C7","v":0},{"$f":"Tenant!$D7","v":0},{"$f":"Tenant!$E7","v":0},{"$f":"Tenant!$G7","v":0},{"$f":"Usage!$D7","v":"00:00:00"},{"$f":"Usage!$E7","v":"00:00:00"},{"$f":"Usage!$F7","v":0},{"$f":"Usage!$G7","v":0},{"$f":"Usage!$H7","v":0},{"$f":"Usage!$L7","v":0},{"$f":"Account!$AI$2","v":0},{"$f":"Usage!$N7","v":0},{"$f":"Usage!$M7","v":0},{"$f":"Account!$AH$2","v":0},{"$f":"Usage!$O7","v":0},0,{"$f":"Tenant!$H7","v":0},{"$f":"Account!$Y$2/100","v":0},{"$f":"Usage!$R7","v":0},{"$f":"Account!$X$2/100","v":0},{"$f":"Usage!$S7","v":0},{"$f":"Tenant!$I7","v":0},{"$f":"Usage!$V7","v":0},{"$f":"Account!$AB$2","v":0},{"$f":"Usage!$X7","v":0},{"$f":"Usage!$W7","v":0},{"$f":"Account!$AA$2","v":0},{"$f":"Usage!$Y7","v":0},{"$f":"Usage!$Z7","v":0},0]
[{"$f":"Tenant!$A8","v":7},{"$f":"Account!$C$2","v":0},{"$f":"Account!$I$2","v":0},{"$f":"Tenant!$B8","v":0},{"$f":"Tenant!$C8","v":0},{"$f":"Tenant!$D8","v":0},{"$f":"Tenant!$E8","v":0},{"$f":"Tenant!$G8","v":0},{"$f":"Usage!$D8","v":"00:00:00"},{"$f":"Usage!$E8","v":"00:00:00"},{"$f":"Usage!$F8","v":0},{"$f":"Usage!$G8","v":0},{"$f":"Usage!$H8","v":0},{"$f":"Usage!$L8","v":0},{"$f":"Account!$AI$2","v":0},{"$f":"Usage!$N8","v":0},{"$f":"Usage!$M8","v":0},{"$f":"Account!$AH$2","v":0},{"$f":"Usage!$O8","v":0},0,{"$f":"Tenant!$H8","v":0},{"$f":"Account!$Y$2/100","v":0},{"$f":"Usage!$R8","v":0},{"$f":"Account!$X$2/100","v":0},{"$f":"Usage!$S8","v":0},{"$f":"Tenant!$I8","v":0},{"$f":"Usage!$V8","v":0},{"$f":"Account!$AB$2","v":0},{"$f":"Usage!$X8","v":0},{"$f":"Usage!$W8","v":0},{"$f":"Account!$AA$2","v":0},{"$f":"Usage!$Y8","v":0},{"$f":"Usage!$Z8","v":0},0]
[{"$f":"Tenant!$A9","v":8},{"$f":"Account!$C$2","v":0},{"$f":"Account!$I$2","v":0},{"$f":"Tenant!$B9","v":0},{"$f":"Tenant!$C9","v":0},{"$f":"Tenant!$D9","v":0},{"$f":"Tenant!$E9","v":0},{"$f":"Tenant!$G9","v":0},{"$f":"Usage!$D9","v":"00:00:00"},{"$f":"Usage!$E9","v":"00:00:00"},{"$f":"Usage!$F9","v":0},{"$f":"Usage!$G9","v":0},{"$f":"Usage!$H9","v":0},{"$f":"Usage!$L9","v":0},{"$f":"Account!$AI$2","v":0},{"$f":"Usage!$N9","v":0},{"$f":"Usage!$M9","v":0},{"$f":"Account!$AH$2","v":0},{"$f":"Usage!$O9","v":0},0,{"$f":"Tenant!$H9","v":0},{"$f":"Account!$Y$2/100","v":0},{"$f":"Usage!$R9","v":0},{"$f":"Account!$X$2/100","v":0},{"$f":"Usage!$S9","v":0},{"$f":"Tenant!$I9","v":0},{"$f":"Usage!$V9","v":0},{"$f":"Account!$AB$2","v":0},{"$f":"Usage!$X9","v":0},{"$f":"Usage!$W9","v":0},{"$f":"Account!$AA$2","v":0},{"$f":"Usage!$Y9","v":0},{"$f":"Usage!$Z9","v":0},0]
[{"$f":"Tenant!$A10","v":9},{"$f":"Account!$C$2","v":0},{"$f":"Account!$I$2","v":0},{"$f":"Tenant!$B10","v":0},{"$f":"Tenant!$C10","v":0},{"$f":"Tenant!$D10","v":0},{"$f":"Tenant!$E10","v":0},{"$f":"Tenant!$G10","v":0},{"$f":"Usage!$D10","v":"00:00:00"},{"$f":"Usage!$E10","v":"00:00:00"},{"$f":"Usage!$F10","v":0},{"$f":"Usage!$G10","v":0},{"$f":"Usage!$H10","v":0},{"$f":"Usage!$L10","v":0},{"$f":"Account!$AI$2","v":0},{"$f":"Usage!$N10","v":0},{"$f":"Usage!$M10","v":0},{"$f":"Account!$AH$2","v":0},{"$f":"Usage!$O10","v":0},0,{"$f":"Tenant!$H10","v":0},{"$f":"Account!$Y$2/100","v":0},{"$f":"Usage!$R10","v":0},{"$f":"Account!$X$2/100","v":0},{"$f":"Usage!$S10","v":0},{"$f":"Tenant!$I10","v":0},{"$f":"Usage!$V10","v":0},{"$f":"Account!$AB$2","v":0},{"$f":"Usage!$X10","v":0},{"$f":"Usage!$W10","v":0},{"$f":"Account!$AA$2","v":0},{"$f":"Usage!$Y10","v":0},{"$f":"Usage!$Z10","v":0},0]
{"$rows_left_out":292}
{"sheet":"BllTmplt","index":7,"n_rows":29,"n_cols":8,"rows_kept":29,"cut":false,"hidden":true,"merged":[[26,0,26,2],[21,0,21,2],[28,0,28,2],[22,0,22,2],[23,0,23,2],[24,0,24,2],[25,0,25,2],[27,0,27,2],[18,0,18,2],[16,0,16,2],[17,0,17,2],[1,0,3,6],[19,0,19,2]]}
[]
["Southern California Edison (SCE) has prepared a bill calculation from information provided by the Mobilehome Park (MHP) management.  Payment should be sent as directed by MHP management.  DO NOT SEND PAYMENTS TO SCE.  For questions, please contact property owner/management."]
[]
[]
[]
[1]
[{"$f":"IF(ISBLANK(Account!H2),\"\",Account!H2)","v":""}]
[{"$f":"\"Owner Name: \"&VLOOKUP($A$6,BllSmmry!A:AH,2,FALSE)","v":"Owner Name: 0"}]
[{"$f":"\"Owner Rate: \"&VLOOKUP($A$6,BllSmmry!A:AH,3,FALSE)","v":"Owner Rate: 0"}]
[{"$f":"\"Tenant Name: \"&VLOOKUP($A$6,BllSmmry!A:AH,4,FALSE)","v":"Tenant Name: 0"}]
{"$rows_left_out":20}
{"sheet":"Dt1","index":8,"n_rows":0,"n_cols":0,"rows_kept":0,"cut":false,"hidden":true,"merged":[]}

{"sheet":"Dt2","index":9,"n_rows":0,"n_cols":0,"rows_kept":0,"cut":false,"hidden":true,"merged":[]}

{"sheet":"Data","index":10,"n_rows":1,"n_cols":1,"rows_kept":1,"cut":false,"hidden":true,"merged":[]}
["Southern California Edison (SCE) has prepared a bill calculation from information provided by the Mobilehome Park (MHP) management.  Payment should be sent as directed by MHP management.  DO NOT SEND PAYMENTS TO SCE.  For questions, please contact property owner/management."]